{"text_format":"1","workbook":"xlsx","n_sheets":14,"sheets":["PROJETO","ATRIBUTOS","SEGMENTOS","USUARIOS","PERFIL","APL_2_NOTA","APL_1_NOTA","APL_2_SAT","APL_1_SAT","APL_2_INSAT","APL_1_INSAT","APL_2_FIDEL","APL_1_FIDEL","COMENTARIOS"],"not_rendered":{"charts":0,"images":0,"macros":1,"external_links":0,"defined_names":22,"comments":0,"pivot_tables":0},"unopened":[],"bounds":{"document_bytes":16777216,"sheet_cells":100000,"rows_first":2000,"rows_last":500,"rows_between":2000,"halvings":0,"cell_chars":16384,"cell_head_chars":4096},"cells_cut":0,"cells_raw":0,"read":"whole","date_system":"1900"}

{"sheet":"PROJETO","index":0,"n_rows":3,"n_cols":2,"rows_kept":3,"cut":false,"hidden":false,"merged":[]}
["ID_Projeto",17281]
["Projeto","Encuesta de Percepción de Valor, Satisfacción y Fidelidad del Cliente de Frasle Mobility y sus Marcas"]
["Data","2025-06-02"]

{"sheet":"ATRIBUTOS","index":1,"n_rows":30,"n_cols":6,"rows_kept":30,"cut":false,"hidden":false,"merged":[]}
["ID_Atributo","Atributo","Grupo","Área / Dimensão","Impacto","Importância"]
[1,"Frecuencia adecuada de contacto, presencia, relación: visitas y contacto por teléfono, correo electrónico y videoconferencia.","Calidaded Percibida","Compra",0.74]
[2,"Eficacia de la visita del vendedor: conocimiento, asesoramiento y consultoría empresarial.","Calidaded Percibida","Compra",0.72]
[3,"Flexibilidad en la negociación para satisfacer sus necesidades.","Calidaded Percibida","Compra",0.84]
[4,"Servicio del equipo de soporte de ventas / back-office: cortesía, amabilidad, eficacia.","Calidaded Percibida","Compra",0.59]
[5,"Entrega del pedido en el plazo acordado.","Calidaded Percibida","Logística",0.75]
{"$rows_left_out":25}
{"sheet":"SEGMENTOS","index":2,"n_rows":60,"n_cols":3,"rows_kept":60,"cut":false,"hidden":false,"merged":[]}
["ID_Segmento","Segmento","Comparativo"]
[2900,"Mercado"]
[17337,"IAM - Brasil + Latam",2900]
[17338,"IAM - Brasil",17337]
[17281,"IAM - Latam",17337]
[17282,"IAM - Aray",17281]
{"$rows_left_out":55}
{"sheet":"USUARIOS","index":3,"n_rows":5,"n_cols":62,"rows_kept":5,"cut":false,"hidden":false,"merged":[]}
["ID_Usuario","Segmento","Senha","Visualiza01","Visualiza02","Visualiza03","Visualiza04","Visualiza05","Visualiza06","Visualiza07","Visualiza08","Visualiza09","Visualiza10","Visualiza11","Visualiza12","Visualiza13","Visualiza14","Visualiza15","Visualiza16","Visualiza17","Visualiza18","Visualiza19","Visualiza20","Visualiza21","Visualiza22","Visualiza23","Visualiza24","Visualiza25","Visualiza26","Visualiza27","Visualiza28","Visualiza29","Visualiza30","Visualiza31","Visualiza32","Visualiza33","Visualiza34","Visualiza35","Visualiza36","Visualiza37","Visualiza38","Visualiza39","Visualiza40","Visualiza41","Visualiza42","Visualiza43","Visualiza44","Visualiza45","Visualiza46","Visualiza47","Visualiza48","Visualiza49","Visualiza50","Visualiza51","Visualiza52","Visualiza53","Visualiza54","Visualiza55","Visualiza56","Visualiza57","Visualiza58","Visualiza59"]
[17281,"IAM - Latam","E3X7L",2900,17337,17338,17281,17282,17283,17284,17285,17286,17287,17288,17289,17290,17291,17292,17293,17294,17295,17296,17297,17298,17299,17300,17301,17302,17303,17304,17305,17306,17307,17308,17309,17310,17311,17312,17313,17314,17315,17316,17317,17318,17319,17320,17321,17322,17323,17324,17325,17326,17327,17328,17329,17330,17331,17332,17333,17334,17335,17336]
[17282,"IAM - Aray","E4X6A",2900,17281,17282,17286,17290,17294,17297,17300,17301,17302,17303,17304,17305,17306,17313,17314,17315,17322,17323,17324,17328,17329,17330]
[17283,"IAM - Fapan","E6X4F",2900,17281,17283,17287,17291,17298,17316,17317,17318,17331,17332,17333]
[17284,"IAM - SSC","E7X3S",2900,17281,17284,17288,17292,17295,17299,17319,17320,17321,17334,17335,17336]

{"sheet":"PERFIL","index":4,"n_rows":60,"n_cols":23,"rows_kept":60,"cut":false,"hidden":false,"merged":[]}
["ID_SEGMENTO","SEGMENTO_NOME","DATA","Cantidad de respondientes","BU","BU","BU","Porte del cliente","Porte del cliente","Porte del cliente","Línea que más compra","Línea que más compra","Línea que más compra","Perfil del evaluador","Perfil del evaluador","Perfil del evaluador","Perfil del evaluador","Perfil del evaluador","Perfil del evaluador","Marca evaluada","Marca evaluada","Marca evaluada","Marca evaluada"]
["-","-","-","-","ARAY","FAPAN","SSC","Clientes A","Clientes B","Clientes C","Ambas líneas","Línea Liviana","Línea Pesada","Compras","Dirección","Gestor","Logística","Marketing","Ventas","Controil","Fras-le","Fremax","Nakata"]
[17337,"IAM - Brasil + Latam","2025-06-02",1227,305,65,64,529,307,262,786,372,69,242,315,184,44,30,412,280,326,248,291]
[17338,"IAM - Brasil","2025-06-02",793,null,null,null,439,188,166,511,260,22,158,172,null,36,23,404,183,178,166,184]
[17281,"IAM - Latam","2025-06-02",434,305,65,64,90,119,96,275,112,47,84,143,184,8,7,8,97,148,82,107]
[17282,"IAM - Aray","2025-06-02",305,null,null,null,90,119,96,192,88,25,35,116,150,4,null,null,72,93,67,73]
{"$rows_left_out":55}
{"sheet":"APL_2_NOTA","index":5,"n_rows":60,"n_cols":34,"rows_kept":60,"cut":false,"hidden":false,"merged":[]}
["ID_Segmento","Segmento","Data",1,2,3,4,5,6,7,8,9,10,11,12,13,14,15,16,17,18,19,20,21,22,23,24,25,26,27,28,29,"IQP","I$P"]
[{"$f":"_xlfn.XLOOKUP(B2,SEGMENTOS!B:B,SEGMENTOS!A:A)","v":2900},"Mercado","2025-06-02",null,null,null,null,null,null,null,null,null,null,null,null,null,null,null,null,null,null,null,null,null,null,null,null,null,null,null,null,null,7.5271352722417593,6.7439058195940635]
[17337,"IAM - Brasil + Latam","2025-06-02",8.0876048462255365,8.3107344632768356,7.7566765578635017,8.6729222520107232,7.1985714285714284,7.6543385490753915,8.5879518072289152,8.026315789473685,7.9,8.236147757255937,9.0422721268163802,7.9504685408299869,7.8876404494382024,7.8397534668721107,8.0974512743628182,7.1567877629063101,7.5213319458896981,6.8137356919875129,8.1844660194174761,7.9705573080967405,8.6098901098901095,8.56786703601108,9.262766945218198,9.2940092165898616,8.7893258426966288,9.0559120073327222,8.5660184237461614,8.2862745098039223,7.9690880989180837,8.1509623651025134,8.3007319043058256]
[17338,"IAM - Brasil","2025-06-02",7.9712643678160919,8.182873730043541,8,8.8896551724137929,7.3609467455621305,7.8694362017804158,8.4333333333333336,7.658682634730539,7.7912087912087911,8.3829787234042552,9.0891472868217047,8.128654970760234,7.7031963470319633,7.8118609406952961,8.0592885375494063,6.968,7.8330849478390459,7.0236336779911372,8.5644654088050309,7.9650986342943852,8.875,8.5882352941176467,9.3252840909090917,9.2841068917018283,8.746762589928057,9.06030855539972,8.6132686084142396,8.3805175038051747,7.896321070234114,8.1958876070838986,8.3323823223524887]
[17281,"IAM - Latam","2025-06-02",8.3023872679045088,8.5469168900804284,7.5531335149863761,8.5350877192982448,7.0469613259668504,7.4562841530054644,8.7063829787234042,8.3145539906103281,7.9868421052631575,7.9211618257261414,8.9419087136929463,7.5598290598290596,8.1824817518248167,7.9249999999999998,8.2173913043478262,7.6351351351351351,6.8,6.313380281690141,7.3539518900343639,7.9828767123287667,8.4517543859649127,8.5555555555555554,9.1447721179624661,9.3128342245989302,8.8686327077747986,9.0476190476190474,8.4846796657381613,8.115702479338843,8.0316091954022983,8.0808772017790957,8.2260637170466833]
[17282,"IAM - Aray","2025-06-02",8.337037037037037,8.6,7.333333333333333,8.5632911392405067,7.0674157303370784,7.3703703703703702,8.6829268292682933,8.3619631901840492,7.9259259259259256,7.7610062893081757,8.9499999999999993,7.4394904458598727,7.9561403508771926,7.7559055118110241,8.1039999999999992,7.4553571428571432,6.7565217391304344,6.0941704035874436,7.339130434782609,8.0349344978165931,8.2292993630573257,8.3717948717948723,9.0912547528517109,9.295454545454545,8.8479087452471479,9.0711610486891381,8.4922480620155039,8.1307692307692303,7.8482490272373537,8.0073037840478509,8.1842287528600171]
{"$rows_left_out":55}
{"sheet":"APL_1_NOTA","index":6,"n_rows":60,"n_cols":34,"rows_kept":60,"cut":false,"hidden":false,"merged":[]}
["ID_Segmento","Segmento","Data",1,2,3,4,5,6,7,8,9,10,11,12,13,14,15,16,17,18,19,20,21,22,23,24,25,26,27,28,29,"IQP","I$P"]
[{"$f":"_xlfn.XLOOKUP(B2,SEGMENTOS!B:B,SEGMENTOS!A:A)","v":2900},"Mercado","2023-06-01"]
[17337,"IAM - Brasil + Latam","2023-06-01"]
[17338,"IAM - Brasil","2023-06-01",7.9861635220125784,8.1542351453855879,8.0129533678756477,8.5625,7.4752941176470591,8.0995370370370363,8.0044052863436121,7.5342465753424657,7.3230088495575218,8.2804878048780495,8.9601386481802425,8.0872600349040145,7.8122605363984672,7.8890977443609023,8.2181818181818187,7.4289405684754524,8.0309278350515463,7.3889602053915278,8.481632653061224,8.1638044914134742,8.7577639751552798,8.567901234567902,9.160479041916167,9.2057074910820447,8.7773809523809518,8.982206405693951,8.5613540197461209,8.2937158469945356,7.7466307277628035,8.188074730865285,8.254322460014027]
[17281,"IAM - Latam","2023-06-01"]
[17282,"IAM - Aray","2023-06-01"]
{"$rows_left_out":55}
{"sheet":"APL_2_SAT","index":7,"n_rows":60,"n_cols":34,"rows_kept":60,"cut":false,"hidden":false,"merged":[]}
["ID_Segmento","Segmento","Data",1,2,3,4,5,6,7,8,9,10,11,12,13,14,15,16,17,18,19,20,21,22,23,24,25,26,27,28,29,"ISQP","IS$P"]
[{"$f":"_xlfn.XLOOKUP(B2,SEGMENTOS!B:B,SEGMENTOS!A:A)","v":2900},"Mercado","2025-06-02",null,null,null,null,null,null,null,null,null,null,null,null,null,null,null,null,null,null,null,null,null,null,null,null,null,null,null,null,null,0.73332269505026482,0.58908416711387934]
[17337,"IAM - Brasil + Latam","2025-06-02",0.82758620689655171,0.84180790960451979,0.8056379821958457,0.93297587131367288,0.69428571428571428,0.77524893314366994,0.93253012048192774,0.85263157894736841,0.81219512195121957,0.88258575197889177,0.96565389696169091,0.81659973226238292,0.8735955056179775,0.81510015408320491,0.82908545727136429,0.6367112810707457,0.76690946930280957,0.60353798126951097,0.84250269687162893,0.80231335436382756,0.9505494505494505,0.92520775623268703,0.98142989786443824,0.97419354838709682,0.9410112359550562,0.96516956920256647,0.90174002047082902,0.88529411764705879,0.8253477588871716,0.8425590169589835,0.8748648500985361]
[17338,"IAM - Brasil","2025-06-02",0.79166666666666663,0.80551523947750359,0.83061889250814336,0.96551724137931039,0.71893491124260356,0.82492581602373882,0.89444444444444449,0.76646706586826352,0.76923076923076927,0.90715667311411996,0.96899224806201545,0.85575048732943471,0.84018264840182644,0.80572597137014312,0.81225296442687744,0.60799999999999998,0.81967213114754101,0.64106351550960117,0.90094339622641506,0.80424886191198786,0.99264705882352944,0.86029411764705888,0.98295454545454541,0.97046413502109707,0.93956834532374101,0.967741935483871,0.90453074433656955,0.89802130898021304,0.81270903010033446,0.84363691495010706,0.87707388592750113]
[17281,"IAM - Latam","2025-06-02",0.8938992042440318,0.90884718498659522,0.78474114441416898,0.91228070175438591,0.67127071823204421,0.72950819672131151,0.96170212765957441,0.92018779342723001,0.84649122807017541,0.82987551867219922,0.95850622406639008,0.73076923076923073,0.92700729927007297,0.84375,0.88198757763975155,0.70945945945945943,0.64482758620689651,0.5140845070422535,0.71477663230240551,0.79794520547945202,0.92543859649122806,0.96444444444444444,0.97855227882037532,0.98128342245989308,0.94369973190348522,0.96031746031746035,0.89693593314763231,0.86225895316804413,0.83620689655172409,0.83793389254574868,0.86767423299234592]
[17282,"IAM - Aray","2025-06-02",0.88888888888888884,0.92075471698113209,0.76779026217228463,0.92405063291139244,0.67041198501872656,0.71851851851851856,0.96951219512195119,0.92638036809815949,0.83333333333333337,0.79874213836477992,0.97499999999999998,0.71974522292993626,0.91228070175438591,0.8582677165354331,0.88,0.6875,0.65652173913043477,0.50224215246636772,0.72608695652173916,0.82096069868995636,0.89171974522292996,0.96153846153846156,0.97338403041825095,0.98106060606060608,0.95437262357414454,0.9662921348314607,0.9031007751937985,0.88076923076923075,0.78599221789883267,0.83582592394772792,0.86295413406308352]
{"$rows_left_out":55}
{"sheet":"APL_1_SAT","index":8,"n_rows":60,"n_cols":34,"rows_kept":60,"cut":false,"hidden":false,"merged":[]}
["ID_Segmento","Segmento","Data",1,2,3,4,5,6,7,8,9,10,11,12,13,14,15,16,17,18,19,20,21,22,23,24,25,26,27,28,29,"ISQP","IS$P"]
[{"$f":"_xlfn.XLOOKUP(B2,SEGMENTOS!B:B,SEGMENTOS!A:A)","v":2900},"Mercado","2023-06-01"]
[17337,"IAM - Brasil + Latam","2023-06-01"]
[17338,"IAM - Brasil","2023-06-01",0.81635220125786168,0.83185840707964598,0.83419689119170981,0.89772727272727271,0.77647058823529413,0.89120370370370372,0.8458149779735683,0.77625570776255703,0.72123893805309736,0.92508710801393723,0.97400346620450606,0.86387434554973819,0.78544061302681989,0.82894736842105265,0.8418181818181818,0.67958656330749356,0.81829896907216493,0.68421052631578949,0.91020408163265309,0.83223249669749011,0.96273291925465843,0.93827160493827155,0.97485029940119761,0.98335315101070153,0.92619047619047623,0.97271648873072358,0.91255289139633289,0.92759562841530052,0.82479784366576825,0.85328678193875374,0.89583727682720793]
[17281,"IAM - Latam","2023-06-01"]
[17282,"IAM - Aray","2023-06-01"]
{"$rows_left_out":55}
{"sheet":"APL_2_INSAT","index":9,"n_rows":60,"n_cols":34,"rows_kept":60,"cut":false,"hidden":false,"merged":[]}
["ID_Segmento","Segmento","Data",1,2,3,4,5,6,7,8,9,10,11,12,13,14,15,16,17,18,19,20,21,22,23,24,25,26,27,28,29,"IIQP","II$P"]
[{"$f":"_xlfn.XLOOKUP(B2,SEGMENTOS!B:B,SEGMENTOS!A:A)","v":2900},"Mercado","2025-06-02",null,null,null,null,null,null,null,null,null,null,null,null,null,null,null,null,null,null,null,null,null,null,null,null,null,null,null,null,null,0.12609096526849661,0.21317148131468522]
[17337,"IAM - Brasil + Latam","2025-06-02",8.3876980428704562E-2,6.5913370998116755E-2,7.5667655786350152E-2,2.4128686327077747E-2,0.12285714285714286,7.8236130867709822E-2,1.6867469879518072E-2,3.6842105263157891E-2,4.6341463414634146E-2,3.0343007915567283E-2,9.247027741083224E-3,5.2208835341365459E-2,3.3707865168539325E-2,7.24191063174114E-2,6.296851574212893E-2,0.16252390057361377,9.4693028095733614E-2,0.20395421436004163,5.070118662351672E-2,5.8885383806519455E-2,8.241758241758242E-3,1.3850415512465374E-2,3.7140204271123491E-3,3.6866359447004608E-3,1.1235955056179775E-2,6.416131989000917E-3,2.3541453428863868E-2,2.4509803921568627E-2,3.4003091190108192E-2,5.7969818805223977E-2,2.6752600266452927E-2]
[17338,"IAM - Brasil","2025-06-02",0.10632183908045977,8.2728592162554432E-2,5.2117263843648211E-2,0,0.1242603550295858,4.7477744807121663E-2,1.6666666666666666E-2,5.3892215568862277E-2,6.5934065934065936E-2,2.321083172147002E-2,5.8139534883720929E-3,4.0935672514619881E-2,3.1963470319634701E-2,7.9754601226993863E-2,7.5098814229249009E-2,0.19466666666666665,6.5573770491803282E-2,0.19054652880354506,2.9874213836477988E-2,5.614567526555387E-2,0,7.3529411764705881E-3,1.4204545454545455E-3,1.4064697609001407E-3,1.1510791366906475E-2,5.6100981767180924E-3,1.6181229773462782E-2,2.2831050228310501E-2,5.016722408026756E-2,5.6078851443993376E-2,2.7893935695790774E-2]
[17281,"IAM - Latam","2025-06-02",4.2440318302387266E-2,3.4852546916890083E-2,9.5367847411444148E-2,3.9473684210526314E-2,0.12154696132596685,0.10655737704918032,1.7021276595744681E-2,2.3474178403755867E-2,3.0701754385964911E-2,4.5643153526970952E-2,1.6597510373443983E-2,7.6923076923076927E-2,3.6496350364963501E-2,0.05,2.4844720496894408E-2,8.1081081081081086E-2,0.16206896551724137,0.23591549295774647,9.6219931271477668E-2,6.5068493150684928E-2,1.3157894736842105E-2,1.7777777777777778E-2,8.0428954423592495E-3,8.0213903743315516E-3,1.0723860589812333E-2,7.9365079365079361E-3,3.6211699164345405E-2,2.7548209366391185E-2,2.0114942528735632E-2,5.8282503770637692E-2,2.8648620199065358E-2]
[17282,"IAM - Aray","2025-06-02",4.0740740740740744E-2,4.1509433962264149E-2,0.12359550561797752,2.5316455696202531E-2,0.11610486891385768,9.6296296296296297E-2,2.4390243902439025E-2,3.0674846625766871E-2,3.7037037037037035E-2,6.2893081761006289E-2,2.5000000000000001E-2,0.10191082802547771,4.3859649122807015E-2,6.2992125984251968E-2,3.2000000000000001E-2,9.8214285714285712E-2,0.17826086956521739,0.28251121076233182,9.1304347826086957E-2,5.6768558951965066E-2,1.9108280254777069E-2,2.564102564102564E-2,1.1406844106463879E-2,1.1363636363636364E-2,1.5209125475285171E-2,1.1235955056179775E-2,3.4883720930232558E-2,3.0769230769230771E-2,2.7237354085603113E-2,6.643860449097011E-2,3.1291391144904535E-2]
{"$rows_left_out":55}
{"sheet":"APL_1_INSAT","index":10,"n_rows":60,"n_cols":34,"rows_kept":60,"cut":false,"hidden":false,"merged":[]}
["ID_Segmento","Segmento","Data",1,2,3,4,5,6,7,8,9,10,11,12,13,14,15,16,17,18,19,20,21,22,23,24,25,26,27,28,29,"IIQP","II$P"]
[{"$f":"_xlfn.XLOOKUP(B2,SEGMENTOS!B:B,SEGMENTOS!A:A)","v":2900},"Mercado","2023-06-01"]
[17337,"IAM - Brasil + Latam","2023-06-01"]
[17338,"IAM - Brasil","2023-06-01",9.3081761006289301E-2,7.9646017699115043E-2,4.4041450777202069E-2,2.8409090909090908E-2,5.8823529411764705E-2,3.0092592592592591E-2,3.5242290748898682E-2,5.4794520547945202E-2,0.10176991150442478,1.3937282229965157E-2,1.0398613518197574E-2,2.0942408376963352E-2,1.532567049808429E-2,5.4511278195488719E-2,4.9090909090909088E-2,0.10335917312661498,3.3505154639175257E-2,0.10269576379974327,1.9047619047619049E-2,4.2272126816380449E-2,0,1.8518518518518517E-2,4.7904191616766467E-3,4.7562425683709865E-3,5.9523809523809521E-3,2.3724792408066431E-3,1.2693935119887164E-2,9.562841530054645E-3,7.277628032345014E-2,4.1262392462737253E-2,2.6810746815812109E-2]
[17281,"IAM - Latam","2023-06-01"]
[17282,"IAM - Aray","2023-06-01"]
{"$rows_left_out":55}
{"sheet":"APL_2_FIDEL","index":11,"n_rows":62,"n_cols":24,"rows_kept":62,"cut":false,"hidden":false,"merged":[]}
["ID_Segmento","Segmento","Data","Frasle Mobility","Frasle Mobility","Frasle Mobility","Frasle Mobility","Frasle Mobility","Frasle Mobility","Frasle Mobility","Frasle Mobility","Frasle Mobility","Frasle Mobility","Frasle Mobility","Frasle Mobility","Frasle Mobility","Frasle Mobility","Frasle Mobility","Frasle Mobility","Frasle Mobility","Frasle Mobility","Frasle Mobility","Frasle Mobility","Frasle Mobility"]
["-","-","-","Satisfación general","Satisfación general","Satisfación general","Satisfación general","Satisfación general","Propensión a continuar","Propensión a continuar","Propensión a continuar","Propensión a continuar","Propensión a continuar","Distancia del ideal","Distancia del ideal","Distancia del ideal","Distancia del ideal","Distancia del ideal","Grado de Fidelidad","Grado de Fidelidad","Grado de Fidelidad","Grado de Fidelidad","Grado de Fidelidad","IFC"]
["-","-","-","Muy satisfechos","Satisfechos","Ni satisfechos tampoco insatisfechos","Insatisfechos","Muy instisfechos","Definitivamente sí","Provabablemente sí","Talvez sim talvez no","Probablemente no","Definitivamente no","Cerca del ideal - 1","Cerca del ideal - 2","A medio camino del ideal","Longe do ideal - 2","Lejo del ideal - 1","Primes","Favorables","Vulnerables","Insatisfechos","Alto riesgo","IFC"]
[{"$f":"_xlfn.XLOOKUP(B4,SEGMENTOS!B:B,SEGMENTOS!A:A)","v":2900},"Mercado","2025-06-02",null,null,null,null,null,null,null,null,null,null,null,null,null,null,null,0.3582076537124933,0.2970767929998635,0.18938138063465829,9.4789426436591162E-2,6.0544746216393525E-2,0.49995027405937209]
[17337,"IAM - Brasil + Latam","2025-06-02",0.48656163113994438,0.41983317886932342,7.3215940685820199E-2,1.7608897126969416E-2,2.7803521779425394E-3,0.79796107506950875,0.1705282669138091,2.5023169601482854E-2,2.7803521779425394E-3,3.7071362372567192E-3,0.4772937905468026,0.37812789620018533,0.11492122335495829,2.3169601482854494E-2,6.4874884151992582E-3,0.59314179796107502,0.34476367006487491,5.375347544022243E-2,4.6339202965708986E-3,3.7071362372567192E-3,0.92956441149212232]
[17338,"IAM - Brasil","2025-06-02",0.51977401129943501,0.37570621468926552,7.7683615819209045E-2,2.2598870056497175E-2,4.2372881355932203E-3,0.7923728813559322,0.1751412429378531,2.2598870056497175E-2,4.2372881355932203E-3,5.6497175141242938E-3,0.48587570621468928,0.38135593220338981,9.8870056497175146E-2,2.6836158192090395E-2,7.0621468926553672E-3,0.60028248587570621,0.33898305084745761,4.9435028248587573E-2,5.6497175141242938E-3,5.6497175141242938E-3,0.92796610169491534]
{"$rows_left_out":57}
{"sheet":"APL_1_FIDEL","index":12,"n_rows":62,"n_cols":24,"rows_kept":62,"cut":false,"hidden":false,"merged":[]}
["ID_Segmento","Segmento","Data","Frasle Mobility","Frasle Mobility","Frasle Mobility","Frasle Mobility","Frasle Mobility","Frasle Mobility","Frasle Mobility","Frasle Mobility","Frasle Mobility","Frasle Mobility","Frasle Mobility","Frasle Mobility","Frasle Mobility","Frasle Mobility","Frasle Mobility","Frasle Mobility","Frasle Mobility","Frasle Mobility","Frasle Mobility","Frasle Mobility","Frasle Mobility"]
["-","-","-","Satisfación general","Satisfación general","Satisfación general","Satisfación general","Satisfación general","Propensión a continuar","Propensión a continuar","Propensión a continuar","Propensión a continuar","Propensión a continuar","Distancia del ideal","Distancia del ideal","Distancia del ideal","Distancia del ideal","Distancia del ideal","Grado de Fidelidad","Grado de Fidelidad","Grado de Fidelidad","Grado de Fidelidad","Grado de Fidelidad","IFC"]
["-","-","-","Muy satisfechos","Satisfechos","Ni satisfechos tampoco insatisfechos","Insatisfechos","Muy instisfechos","Definitivamente sí","Provabablemente sí","Talvez sim talvez no","Probablemente no","Definitivamente no","Cerca del ideal - 1","Cerca del ideal - 2","A medio camino del ideal","Longe do ideal - 2","Lejo del ideal - 1","Primes","Favorables","Vulnerables","Insatisfechos","Alto riesgo","IFC"]
[{"$f":"_xlfn.XLOOKUP(B4,SEGMENTOS!B:B,SEGMENTOS!A:A)","v":2900},"Mercado","2023-06-01"]
[17337,"IAM - Brasil + Latam","2023-06-01"]
[17338,"IAM - Brasil","2023-06-01",0.4821002386634845,0.41050119331742241,7.3985680190930783E-2,2.2673031026252982E-2,1.0739856801909307E-2,0.78042959427207637,0.17780429594272076,2.8639618138424822E-2,1.3126491646778043E-2,0,null,null,null,null,null,0.52505966587112174,0.39856801909307876,5.4892601431980909E-2,2.028639618138425E-2,1.1933174224343676E-3,0.90214797136038183]
{"$rows_left_out":57}
{"sheet":"COMENTARIOS","index":13,"n_rows":1081,"n_cols":8,"rows_kept":1081,"cut":false,"hidden":false,"merged":[]}
["Area_dimensao","Comentário","Classificacao","Segmento","Macrorregião","BU","VISUALIZA01","VISUALIZA02"]
["Compra","A modo de crítica unicamente el tema de stock de algunas referencias, tenemos pieza que no ingresaron en el ultimo año por ejemplo.",null,"Aftermarket","Latam","ARAY",17281,17282]
["Compra","Elogios con Frasle todos, solo que en el último tiempo tambien estuvieron un poco flojos respecto del stock de referencias de alta rotación. Asi como tambien el lanzamiento tardio de algunos modelos que son top en venta dentro de nuestro mercado, como por ejemplo la pastillas del cronos nuevo.",null,"Aftermarket","Latam","ARAY",17281,17282]
["Compra","A nuestro criterio una de las lineas que mejor se posiciona. Seria ideal copiar la politica de lanzamientos para el resto de las marcas.",null,"Aftermarket","Latam","ARAY",17281,17282]
["Compra","Nakata en lineas generales está muy bien, pero tambien nos encontramos con momentos de escaces de referencias importantes.",null,"Aftermarket","Latam","ARAY",17281,17282]
["Compra","El cliente evalúa que Frasle Mobility lanza muchos productos al mercado y concluye que es casi imposible que el vendedor siga la evolución de este proceso, conociendo en detalle cualquiera de los productos. Por esta razón, el cliente otorga una puntuación satisfactoria como 7 o 8. En términos de flexibilidad en la negociación, el cliente evalúa que no hay una persona de contacto dentro de Frasle Mobility que preste algo de atención al mercado uruguayo. Comenta que muchas veces queda sin respuestas a sus preguntas. Y, con excepción de Fremax, la falta de una persona de contacto en las otras marcas lo deja perdido sobre cómo resolver un tema que necesita negociar.",null,"Aftermarket","Latam","ARAY",17281,17282]
{"$rows_left_out":1075}