{"text_format":"1","workbook":"xlsx","n_sheets":14,"sheets":["PROJETO","ATRIBUTOS","SEGMENTOS","USUARIOS","PERFIL","APL_2_NOTA","APL_1_NOTA","APL_2_SAT","APL_1_SAT","APL_2_INSAT","APL_1_INSAT","APL_2_FIDEL","APL_1_FIDEL","COMENTARIOS"],"not_rendered":{"charts":0,"images":0,"macros":1,"external_links":0,"defined_names":20,"comments":0,"pivot_tables":0},"unopened":[],"bounds":{"document_bytes":16777216,"sheet_cells":100000,"rows_first":2000,"rows_last":500,"rows_between":2000,"halvings":0,"cell_chars":16384,"cell_head_chars":4096},"cells_cut":0,"cells_raw":0,"read":"whole","date_system":"1900"}

{"sheet":"PROJETO","index":0,"n_rows":3,"n_cols":2,"rows_kept":3,"cut":false,"hidden":false,"merged":[]}
["ID_Projeto",31940]
["Projeto","Pesquisa de Percepção de Valor, Satisfação e Fidelidade\u000bdo Cliente de Recarga em Eletropostos"]
["Data","2024-09-24"]

{"sheet":"ATRIBUTOS","index":1,"n_rows":12,"n_cols":6,"rows_kept":12,"cut":false,"hidden":false,"merged":[]}
["ID_Atributo","Atributo","Grupo","Área / Dimensão","Impacto","Importância"]
[1,"Localização: facilidade de acesso.","Qualidade Percebida","Eletroposto",0.61]
[2,"Tempo de espera para utilizar o carregador (assim que chega).","Qualidade Percebida","Eletroposto",0.68]
[3,"Infraestrutura adequada do eletroposto (vagas, carregadores, entorno e segurança).","Qualidade Percebida","Eletroposto",0.78]
[4,"Informações suficientes e claras para realizar o carregamento.","Qualidade Percebida","Eletroposto",0.8]
[5,"Tempo de carregamento.","Qualidade Percebida","Eletroposto",0.69]
[6,"Facilidade em fazer download do aplicativo.","Qualidade Percebida"," App WeCharge",0.64]
[7,"Facilidade de cadastro.","Qualidade Percebida"," App WeCharge",0.61]
{"$rows_left_out":5}
{"sheet":"SEGMENTOS","index":2,"n_rows":42,"n_cols":3,"rows_kept":42,"cut":false,"hidden":false,"merged":[]}
["ID_Segmento","Segmento","Comparativo"]
[2900,"Mercado"]
[31940,"Todos os Eletropostos",2900]
[31941,"Eletropostos EDP",31940]
[31942,"Eletropostos\nWeCharge + Certaja",31940]
[31944,"Eletropostos de SP e MG",31940]
[31945,"Eletropostos do ES e RJ",31940]
[31946,"Eletropostos do RS e SC",31940]
{"$rows_left_out":35}
{"sheet":"USUARIOS","index":3,"n_rows":2,"n_cols":44,"rows_kept":2,"cut":false,"hidden":false,"merged":[]}
["ID_Usuario","Segmento","Senha","Visualiza01","Visualiza02","Visualiza03","Visualiza04","Visualiza05","Visualiza06","Visualiza07","Visualiza08","Visualiza09","Visualiza10","Visualiza11","Visualiza12","Visualiza13","Visualiza14","Visualiza15","Visualiza16","Visualiza17","Visualiza18","Visualiza19","Visualiza20","Visualiza21","Visualiza22","Visualiza23","Visualiza24","Visualiza25","Visualiza26","Visualiza27","Visualiza28","Visualiza29","Visualiza30","Visualiza31","Visualiza32","Visualiza33","Visualiza34","Visualiza35","Visualiza36","Visualiza37","Visualiza38","Visualiza39","Visualiza40","Visualiza41"]
[31940,"Todos os Eletropostos","U6P7H",2900,31940,31941,31942,31944,31945,31946,31948,31949,31950,31951,31952,31953,31954,31955,31957,31958,31960,31961,31962,31963,31965,31966,31967,31969,31970,31974,31976,31977,31978,31979,31981,31982,31983,31984,31986,31987,31988,31989,31990,31991]

{"sheet":"PERFIL","index":4,"n_rows":42,"n_cols":22,"rows_kept":42,"cut":false,"hidden":false,"merged":[]}
["ID_SEGMENTO","SEGMENTO_NOME","DATA","Qtd. de respondentes","Frequência média de utilização","Frequência média de utilização","Frequência média de utilização","Frequência média de utilização","Frequência média de utilização","Motivo de utilização","Motivo de utilização","Motivo de utilização","Motivo de utilização","Trajeto médio","Trajeto médio","Trajeto médio","Marca","Marca","Marca","Região","Região","Região"]
["-","-","-","-","A cada 15 dias","A cada 2 ou 3 meses","A cada mês","Alguns dias da semana","Todos os dias da semana","Passeios (curtos)","Rotina diária","Trabalho","Viagens","Trajetos curtos - Até 50 km","Trajetos longos - Mais de 150 km","Trajetos médios - De 51 a 150 km","Certaja","EDP","WeCharge","RJ e ES","RS e SC","SP e MG"]
[31940,{"$f":"_xlfn.XLOOKUP(A3,SEGMENTOS!$A$3:$A$42,SEGMENTOS!$B$3:$B$42)","v":"Todos os Eletropostos"},"2024-09-24",310,68,94,89,52,7,19,11,60,220,5,242,63,13,244,53,32,47,231]
[31941,{"$f":"_xlfn.XLOOKUP(A4,SEGMENTOS!$A$3:$A$42,SEGMENTOS!$B$3:$B$42)","v":"Eletropostos EDP"},"2024-09-24",244,53,71,75,39,6,17,6,47,174,2,194,48,null,null,null,29,2,213]
[31942,{"$f":"_xlfn.XLOOKUP(A5,SEGMENTOS!$A$3:$A$42,SEGMENTOS!$B$3:$B$42)","v":"Eletropostos\nWeCharge + Certaja"},"2024-09-24",66,15,23,14,13,1,2,5,13,66,3,48,15,null,null,null,3,45,18]
[31944,{"$f":"_xlfn.XLOOKUP(A6,SEGMENTOS!$A$3:$A$42,SEGMENTOS!$B$3:$B$42)","v":"Eletropostos de SP e MG"},"2024-09-24",231,56,64,70,38,3,16,3,49,163,2,179,50,null,213,18]
[31945,{"$f":"_xlfn.XLOOKUP(A7,SEGMENTOS!$A$3:$A$42,SEGMENTOS!$B$3:$B$42)","v":"Eletropostos do ES e RJ"},"2024-09-24",32,3,13,9,4,3,2,4,3,23,null,31,1,null,29,3]
[31946,{"$f":"_xlfn.XLOOKUP(A8,SEGMENTOS!$A$3:$A$42,SEGMENTOS!$B$3:$B$42)","v":"Eletropostos do RS e SC"},"2024-09-24",47,9,17,10,10,1,1,4,8,34,3,32,12,13,2,32]
{"$rows_left_out":35}
{"sheet":"APL_2_NOTA","index":5,"n_rows":42,"n_cols":16,"rows_kept":42,"cut":false,"hidden":false,"merged":[]}
["ID_Segmento","Segmento","Data",1,2,3,4,5,6,7,8,9,10,11,"IQP","I$P"]
[2900,"Mercado","2024-09-24"]
[31940,{"$f":"_xlfn.XLOOKUP(A3,SEGMENTOS!$A$3:$A$42,SEGMENTOS!$B$3:$B$42)","v":"Todos os Eletropostos"},"2024-09-24",8.0935483870967744,6.7864077669902914,7.0849673202614376,7.2312703583061886,7.2138157894736841,8.2755102040816322,7.8775510204081636,6.8549222797927465,7.6185567010309274,7.6439790575916229,7.0915032679738559,7.4090162309059755]
[31941,{"$f":"_xlfn.XLOOKUP(A4,SEGMENTOS!$A$3:$A$42,SEGMENTOS!$B$3:$B$42)","v":"Eletropostos EDP"},"2024-09-24",8.0696721311475414,6.6584362139917692,6.9419087136929463,7.1404958677685952,7.2647058823529411,8.2444444444444436,7.8444444444444441,6.7894736842105265,7.4925373134328357,7.5298507462686564,6.8785046728971961,7.3215270577484022]
[31942,{"$f":"_xlfn.XLOOKUP(A5,SEGMENTOS!$A$3:$A$42,SEGMENTOS!$B$3:$B$42)","v":"Eletropostos\nWeCharge + Certaja"},"2024-09-24",8.1818181818181817,7.2575757575757578,7.615384615384615,7.569230769230769,7.0303030303030303,8.3442622950819665,7.9508196721311473,7,7.9,7.9122807017543861,7.5869565217391308,7.6556556108159981]
[31944,{"$f":"_xlfn.XLOOKUP(A6,SEGMENTOS!$A$3:$A$42,SEGMENTOS!$B$3:$B$42)","v":"Eletropostos de SP e MG"},"2024-09-24",8.1212121212121211,6.7575757575757578,7,7.1754385964912277,7.4755555555555553,8.2518518518518515,7.7555555555555555,6.7424242424242422,7.5338345864661651,7.6015037593984962,7,7.3749141250458736]
[31945,{"$f":"_xlfn.XLOOKUP(A7,SEGMENTOS!$A$3:$A$42,SEGMENTOS!$B$3:$B$42)","v":"Eletropostos do ES e RJ"},"2024-09-24",7.53125,6.625,6.65625,6.75,5.90625,7.7222222222222223,7.7222222222222223,6.666666666666667,7.6111111111111107,7.333333333333333,6,6.9257998270644165]
[31946,{"$f":"_xlfn.XLOOKUP(A8,SEGMENTOS!$A$3:$A$42,SEGMENTOS!$B$3:$B$42)","v":"Eletropostos do RS e SC"},"2024-09-24",8.3404255319148941,7.0434782608695654,7.8043478260869561,7.8297872340425529,6.8510638297872344,8.5813953488372086,8.3255813953488378,7.2790697674418601,7.8837209302325579,7.9249999999999998,7.875,7.7821139469060441]
{"$rows_left_out":35}
{"sheet":"APL_1_NOTA","index":6,"n_rows":42,"n_cols":16,"rows_kept":42,"cut":false,"hidden":false,"merged":[]}
["ID_Segmento","Segmento","Data",1,2,3,4,5,6,7,8,9,10,11,"IQP","I$P"]
[2900,"Mercado","2022-04-14"]
[31940,{"$f":"_xlfn.XLOOKUP(A3,SEGMENTOS!$A$3:$A$42,SEGMENTOS!$B$3:$B$42)","v":"Todos os Eletropostos"},"2022-04-14"]
[31941,{"$f":"_xlfn.XLOOKUP(A4,SEGMENTOS!$A$3:$A$42,SEGMENTOS!$B$3:$B$42)","v":"Eletropostos EDP"},"2022-04-14",8.1688311688311686,8.1558441558441555,7.662337662337662,7.8051948051948052,7.4155844155844157,8.8405797101449277,0,8.0294117647058822,7.8088235294117645,8.815384615384616,0,8.0485981809047811]
[31942,{"$f":"_xlfn.XLOOKUP(A5,SEGMENTOS!$A$3:$A$42,SEGMENTOS!$B$3:$B$42)","v":"Eletropostos\nWeCharge + Certaja"},"2022-04-14"]
[31944,{"$f":"_xlfn.XLOOKUP(A6,SEGMENTOS!$A$3:$A$42,SEGMENTOS!$B$3:$B$42)","v":"Eletropostos de SP e MG"},"2022-04-14"]
[31945,{"$f":"_xlfn.XLOOKUP(A7,SEGMENTOS!$A$3:$A$42,SEGMENTOS!$B$3:$B$42)","v":"Eletropostos do ES e RJ"},"2022-04-14"]
[31946,{"$f":"_xlfn.XLOOKUP(A8,SEGMENTOS!$A$3:$A$42,SEGMENTOS!$B$3:$B$42)","v":"Eletropostos do RS e SC"},"2022-04-14"]
{"$rows_left_out":35}
{"sheet":"APL_2_SAT","index":7,"n_rows":42,"n_cols":16,"rows_kept":42,"cut":false,"hidden":false,"merged":[]}
["ID_Segmento","Segmento","Data",1,2,3,4,5,6,7,8,9,10,11,"ISQP","IS$P"]
[2900,"Mercado","2024-09-24"]
[31940,{"$f":"_xlfn.XLOOKUP(A3,SEGMENTOS!$A$3:$A$42,SEGMENTOS!$B$3:$B$42)","v":"Todos os Eletropostos"},"2024-09-24",0.82580645161290323,0.61488673139158578,0.66993464052287577,0.70684039087947881,0.68421052631578949,0.83673469387755106,0.77040816326530615,0.62176165803108807,0.74742268041237114,0.76963350785340312,0.68627450980392157,0.71820738989412125]
[31941,{"$f":"_xlfn.XLOOKUP(A4,SEGMENTOS!$A$3:$A$42,SEGMENTOS!$B$3:$B$42)","v":"Eletropostos EDP"},"2024-09-24",0.81967213114754101,0.59259259259259256,0.65560165975103735,0.69008264462809921,0.70168067226890751,0.81481481481481477,0.75555555555555554,0.61654135338345861,0.72388059701492535,0.74626865671641796,0.66355140186915884,0.7039956320049805]
[31942,{"$f":"_xlfn.XLOOKUP(A5,SEGMENTOS!$A$3:$A$42,SEGMENTOS!$B$3:$B$42)","v":"Eletropostos\nWeCharge + Certaja"},"2024-09-24",0.84848484848484851,0.69696969696969702,0.72307692307692306,0.76923076923076927,0.62121212121212122,0.88524590163934425,0.80327868852459017,0.6333333333333333,0.8,0.82456140350877194,0.73913043478260865,0.75648182825402743]
[31944,{"$f":"_xlfn.XLOOKUP(A6,SEGMENTOS!$A$3:$A$42,SEGMENTOS!$B$3:$B$42)","v":"Eletropostos de SP e MG"},"2024-09-24",0.82251082251082253,0.59740259740259738,0.65350877192982459,0.68859649122807021,0.73333333333333328,0.82222222222222219,0.7407407407407407,0.60606060606060608,0.72180451127819545,0.75187969924812026,0.67289719626168221,0.70688529573956338]
[31945,{"$f":"_xlfn.XLOOKUP(A7,SEGMENTOS!$A$3:$A$42,SEGMENTOS!$B$3:$B$42)","v":"Eletropostos do ES e RJ"},"2024-09-24",0.75,0.65625,0.625,0.625,0.46875,0.72222222222222221,0.72222222222222221,0.61111111111111116,0.83333333333333337,0.77777777777777779,0.6428571428571429,0.67387295925720048]
[31946,{"$f":"_xlfn.XLOOKUP(A8,SEGMENTOS!$A$3:$A$42,SEGMENTOS!$B$3:$B$42)","v":"Eletropostos do RS e SC"},"2024-09-24",0.8936170212765957,0.67391304347826086,0.78260869565217395,0.85106382978723405,0.5957446808510638,0.93023255813953487,0.88372093023255816,0.67441860465116277,0.79069767441860461,0.82499999999999996,0.75,0.78422262823000999]
{"$rows_left_out":35}
{"sheet":"APL_1_SAT","index":8,"n_rows":42,"n_cols":16,"rows_kept":42,"cut":false,"hidden":false,"merged":[]}
["ID_Segmento","Segmento","Data",1,2,3,4,5,6,7,8,9,10,11,"ISQP","IS$P"]
[2900,"Mercado","2022-04-14"]
[31940,{"$f":"_xlfn.XLOOKUP(A3,SEGMENTOS!$A$3:$A$42,SEGMENTOS!$B$3:$B$42)","v":"Todos os Eletropostos"},"2022-04-14"]
[31941,{"$f":"_xlfn.XLOOKUP(A4,SEGMENTOS!$A$3:$A$42,SEGMENTOS!$B$3:$B$42)","v":"Eletropostos EDP"},"2022-04-14",0.8441558441558441,0.8441558441558441,0.76623376623376627,0.76623376623376627,0.70129870129870131,0.89855072463768115,0,0.83823529411764708,0.76470588235294112,0.89230769230769236,0,0.80721224652278134]
[31942,{"$f":"_xlfn.XLOOKUP(A5,SEGMENTOS!$A$3:$A$42,SEGMENTOS!$B$3:$B$42)","v":"Eletropostos\nWeCharge + Certaja"},"2022-04-14"]
[31944,{"$f":"_xlfn.XLOOKUP(A6,SEGMENTOS!$A$3:$A$42,SEGMENTOS!$B$3:$B$42)","v":"Eletropostos de SP e MG"},"2022-04-14"]
[31945,{"$f":"_xlfn.XLOOKUP(A7,SEGMENTOS!$A$3:$A$42,SEGMENTOS!$B$3:$B$42)","v":"Eletropostos do ES e RJ"},"2022-04-14"]
[31946,{"$f":"_xlfn.XLOOKUP(A8,SEGMENTOS!$A$3:$A$42,SEGMENTOS!$B$3:$B$42)","v":"Eletropostos do RS e SC"},"2022-04-14"]
{"$rows_left_out":35}
{"sheet":"APL_2_INSAT","index":9,"n_rows":42,"n_cols":16,"rows_kept":42,"cut":false,"hidden":false,"merged":[]}
["ID_Segmento","Segmento","Data",1,2,3,4,5,6,7,8,9,10,11,"IIQP","II$P"]
[2900,"Mercado","2024-09-24"]
[31940,{"$f":"_xlfn.XLOOKUP(A3,SEGMENTOS!$A$3:$A$42,SEGMENTOS!$B$3:$B$42)","v":"Todos os Eletropostos"},"2024-09-24",9.3548387096774197E-2,0.23624595469255663,0.18627450980392157,0.17915309446254071,0.17763157894736842,4.5918367346938778E-2,7.1428571428571425E-2,0.18134715025906736,0.10309278350515463,0.11518324607329843,0.15032679738562091,0.1425864108775991]
[31941,{"$f":"_xlfn.XLOOKUP(A4,SEGMENTOS!$A$3:$A$42,SEGMENTOS!$B$3:$B$42)","v":"Eletropostos EDP"},"2024-09-24",9.4262295081967207E-2,0.23868312757201646,0.2074688796680498,0.19008264462809918,0.18487394957983194,3.7037037037037035E-2,7.407407407407407E-2,0.18796992481203006,0.11194029850746269,0.12686567164179105,0.17757009345794392,0.15150639371020169]
[31942,{"$f":"_xlfn.XLOOKUP(A5,SEGMENTOS!$A$3:$A$42,SEGMENTOS!$B$3:$B$42)","v":"Eletropostos\nWeCharge + Certaja"},"2024-09-24",9.0909090909090912E-2,0.22727272727272727,0.1076923076923077,0.13846153846153847,0.15151515151515152,6.5573770491803282E-2,6.5573770491803282E-2,0.16666666666666666,8.3333333333333329E-2,8.771929824561403E-2,8.6956521739130432E-2,0.11614935073383799]
[31944,{"$f":"_xlfn.XLOOKUP(A6,SEGMENTOS!$A$3:$A$42,SEGMENTOS!$B$3:$B$42)","v":"Eletropostos de SP e MG"},"2024-09-24",9.0909090909090912E-2,0.23376623376623376,0.20175438596491227,0.18859649122807018,0.16888888888888889,4.4444444444444446E-2,7.407407407407407E-2,0.19696969696969696,0.11278195488721804,0.10526315789473684,0.15887850467289719,0.1462816661661149]
[31945,{"$f":"_xlfn.XLOOKUP(A7,SEGMENTOS!$A$3:$A$42,SEGMENTOS!$B$3:$B$42)","v":"Eletropostos do ES e RJ"},"2024-09-24",0.15625,0.25,0.1875,0.21875,0.25,5.5555555555555552E-2,0.16666666666666666,0.22222222222222221,5.5555555555555552E-2,0.22222222222222221,0.2857142857142857,0.19026195108393551]
[31946,{"$f":"_xlfn.XLOOKUP(A8,SEGMENTOS!$A$3:$A$42,SEGMENTOS!$B$3:$B$42)","v":"Eletropostos do RS e SC"},"2024-09-24",6.3829787234042548E-2,0.2391304347826087,0.10869565217391304,0.10638297872340426,0.1702127659574468,4.6511627906976744E-2,2.3255813953488372E-2,0.11627906976744186,9.3023255813953487E-2,0.1,6.25E-2,0.10369534775178116]
{"$rows_left_out":35}
{"sheet":"APL_1_INSAT","index":10,"n_rows":42,"n_cols":16,"rows_kept":42,"cut":false,"hidden":false,"merged":[]}
["ID_Segmento","Segmento","Data",1,2,3,4,5,6,7,8,9,10,11,"IIQP","II$P"]
[2900,"Mercado","2022-04-14"]
[31940,{"$f":"_xlfn.XLOOKUP(A3,SEGMENTOS!$A$3:$A$42,SEGMENTOS!$B$3:$B$42)","v":"Todos os Eletropostos"},"2022-04-14"]
[31941,{"$f":"_xlfn.XLOOKUP(A4,SEGMENTOS!$A$3:$A$42,SEGMENTOS!$B$3:$B$42)","v":"Eletropostos EDP"},"2022-04-14",7.792207792207792E-2,6.4935064935064929E-2,0.16883116883116883,0.11688311688311688,0.12987012987012986,1.4492753623188406E-2,0,0.10294117647058823,0.11764705882352941,3.0769230769230771E-2,0,9.6688269007262143E-2]
[31942,{"$f":"_xlfn.XLOOKUP(A5,SEGMENTOS!$A$3:$A$42,SEGMENTOS!$B$3:$B$42)","v":"Eletropostos\nWeCharge + Certaja"},"2022-04-14"]
[31944,{"$f":"_xlfn.XLOOKUP(A6,SEGMENTOS!$A$3:$A$42,SEGMENTOS!$B$3:$B$42)","v":"Eletropostos de SP e MG"},"2022-04-14"]
[31945,{"$f":"_xlfn.XLOOKUP(A7,SEGMENTOS!$A$3:$A$42,SEGMENTOS!$B$3:$B$42)","v":"Eletropostos do ES e RJ"},"2022-04-14"]
[31946,{"$f":"_xlfn.XLOOKUP(A8,SEGMENTOS!$A$3:$A$42,SEGMENTOS!$B$3:$B$42)","v":"Eletropostos do RS e SC"},"2022-04-14"]
{"$rows_left_out":35}
{"sheet":"APL_2_FIDEL","index":11,"n_rows":44,"n_cols":24,"rows_kept":44,"cut":false,"hidden":false,"merged":[]}
["ID_Segmento","Segmento","Data","GESEL","GESEL","GESEL","GESEL","GESEL","GESEL","GESEL","GESEL","GESEL","GESEL","GESEL","GESEL","GESEL","GESEL","GESEL","GESEL","GESEL","GESEL","GESEL","GESEL","GESEL"]
["-","-","-","Satisfação geral","Satisfação geral","Satisfação geral","Satisfação geral","Satisfação geral","Propensão a reutilizar","Propensão a reutilizar","Propensão a reutilizar","Propensão a reutilizar","Propensão a reutilizar","Propensão a recomendar","Propensão a recomendar","Propensão a recomendar","Propensão a recomendar","Propensão a recomendar","Nível de Fidelidade","Nível de Fidelidade","Nível de Fidelidade","Nível de Fidelidade","Nível de Fidelidade","IFC"]
["-","-","-","Muito satisfeito","Satisfeito","Nem satisfeito nem insatisfeito","Insatisfeito","Muito insatisfeito","Definitivamente sim","Provavalmente sim","Talvez sim talvez não","Provavelmente não","Definitivamente não","Definitivamente sim","Provavalmente sim","Talvez sim talvez não","Provavelmente não","Definitivamente não","Clientes Prime","Clientes Favoráveis","Clientes Vulneráveis","Clientes Insatisfeitos","Clientes de Alto Risco","IFC"]
[2900,"Mercado","2024-09-24"]
[31940,{"$f":"_xlfn.XLOOKUP(A5,PERFIL!$A$3:$A$42,PERFIL!$B$3:$B$42)","v":"Todos os Eletropostos"},"2024-09-24",0.31147540983606559,0.32786885245901637,0.21639344262295082,0.10163934426229508,4.2622950819672129E-2,0.52131147540983602,0.31475409836065577,9.8360655737704916E-2,3.2786885245901641E-2,3.2786885245901641E-2,0.47540983606557374,0.27868852459016391,0.14426229508196722,6.2295081967213117E-2,3.9344262295081971E-2,0.42622950819672129,0.30163934426229511,0.17049180327868851,6.8852459016393447E-2,3.2786885245901641E-2,0.6262295081967213]
[31941,{"$f":"_xlfn.XLOOKUP(A6,PERFIL!$A$3:$A$42,PERFIL!$B$3:$B$42)","v":"Eletropostos EDP"},"2024-09-24",0.29166666666666669,0.32500000000000001,0.22083333333333333,0.1125,0.05,0.51666666666666672,0.30416666666666664,0.10416666666666667,3.3333333333333333E-2,4.1666666666666664E-2,0.47083333333333333,0.25833333333333336,0.16250000000000001,6.25E-2,4.583333333333333E-2,0.41249999999999998,0.29166666666666669,0.18333333333333332,7.0833333333333331E-2,4.1666666666666664E-2,0.59166666666666667]
[31942,{"$f":"_xlfn.XLOOKUP(A7,PERFIL!$A$3:$A$42,PERFIL!$B$3:$B$42)","v":"Eletropostos\nWeCharge + Certaja"},"2024-09-24",0.38461538461538464,0.33846153846153848,0.2,6.1538461538461542E-2,1.5384615384615385E-2,0.53846153846153844,0.35384615384615387,7.6923076923076927E-2,3.0769230769230771E-2,0,0.49230769230769234,0.35384615384615387,7.6923076923076927E-2,6.1538461538461542E-2,1.5384615384615385E-2,0.47692307692307695,0.33846153846153848,0.12307692307692308,6.1538461538461542E-2,0,0.75384615384615383]
[31944,{"$f":"_xlfn.XLOOKUP(A8,PERFIL!$A$3:$A$42,PERFIL!$B$3:$B$42)","v":"Eletropostos de SP e MG"},"2024-09-24",0.30701754385964913,0.30701754385964913,0.22807017543859648,0.10526315789473684,5.2631578947368418E-2,0.50438596491228072,0.32456140350877194,0.10526315789473684,2.1929824561403508E-2,4.3859649122807015E-2,0.47368421052631576,0.26754385964912281,0.14912280701754385,6.1403508771929821E-2,4.8245614035087717E-2,0.42105263157894735,0.28947368421052633,0.18421052631578946,6.1403508771929821E-2,4.3859649122807015E-2,0.60526315789473684]
{"$rows_left_out":37}
{"sheet":"APL_1_FIDEL","index":12,"n_rows":44,"n_cols":24,"rows_kept":44,"cut":false,"hidden":false,"merged":[]}
["ID_Segmento","Segmento","Data","GESEL","GESEL","GESEL","GESEL","GESEL","GESEL","GESEL","GESEL","GESEL","GESEL","GESEL","GESEL","GESEL","GESEL","GESEL","GESEL","GESEL","GESEL","GESEL","GESEL","GESEL"]
["-","-","-","Satisfação geral","Satisfação geral","Satisfação geral","Satisfação geral","Satisfação geral","Propensão a reutilizar","Propensão a reutilizar","Propensão a reutilizar","Propensão a reutilizar","Propensão a reutilizar","Propensão a recomendar","Propensão a recomendar","Propensão a recomendar","Propensão a recomendar","Propensão a recomendar","Nível de Fidelidade","Nível de Fidelidade","Nível de Fidelidade","Nível de Fidelidade","Nível de Fidelidade","IFC"]
["-","-","-","Muito satisfeito","Satisfeito","Nem satisfeito nem insatisfeito","Insatisfeito","Muito insatisfeito","Definitivamente sim","Provavalmente sim","Talvez sim talvez não","Provavelmente não","Definitivamente não","Definitivamente sim","Provavalmente sim","Talvez sim talvez não","Provavelmente não","Definitivamente não","Clientes Prime","Clientes Favoráveis","Clientes Vulneráveis","Clientes Insatisfeitos","Clientes de Alto Risco","IFC"]
[2900,"Mercado","2022-04-14"]
[31940,{"$f":"_xlfn.XLOOKUP(A5,PERFIL!$A$3:$A$42,PERFIL!$B$3:$B$42)","v":"Todos os Eletropostos"},"2022-04-14"]
[31941,{"$f":"_xlfn.XLOOKUP(A6,PERFIL!$A$3:$A$42,PERFIL!$B$3:$B$42)","v":"Eletropostos EDP"},"2022-04-14",0.35064935064934999,0.48051948051948001,0.103896103896103,5.1948051948051903E-2,1.2987012987012899E-2,0.77922077922077904,0.19480519480519401,1.2987012987012899E-2,0,1.2987012987012899E-2,0.75324675324675305,0.168831168831168,6.4935064935064901E-2,0,1.2987012987012899E-2,0.70129870129870098,0.207792207792207,7.7922077922077906E-2,0,1.2987012987012899E-2,0.89610389610389596]
[31942,{"$f":"_xlfn.XLOOKUP(A7,PERFIL!$A$3:$A$42,PERFIL!$B$3:$B$42)","v":"Eletropostos\nWeCharge + Certaja"},"2022-04-14"]
[31944,{"$f":"_xlfn.XLOOKUP(A8,PERFIL!$A$3:$A$42,PERFIL!$B$3:$B$42)","v":"Eletropostos de SP e MG"},"2022-04-14"]
{"$rows_left_out":37}
{"sheet":"COMENTARIOS","index":13,"n_rows":155,"n_cols":4,"rows_kept":155,"cut":false,"hidden":false,"merged":[]}
["Area_dimensao","Comentário","Classificacao","VISUALIZA01"]
["Eletropostos","Acho que a WeCharge está de parabéns, acredito que poderia ajustar melhor o preço do kW/h pois ainda está um pouco acima da média dos demais… tupinambá R$ 1.70 kW/h e também eletropostos ultrarrápidos.",null,31940]
["Eletropostos","Baratear mais o kilowatt.",null,31940]
["Eletropostos","É necessário que seja instalado mais pontos de carga em Camburi, só tem um carregador e é meio lento. Então está sempre com fila.",null,31940]
["Eletropostos","Eletroposto de Guarapari em péssimo local. Perto das escunas, não dá para manobrar e jogar o carro de re, aval conector atrás. Vaga constantemente ocupada por outros carros. Sugestão: cobrar tempo de ociosidade.",null,31940]
["Eletropostos","Há apenas 1 carregador ultrarrápido.",null,31940]
["Eletropostos","Necessário carregadores DC ao longo das Rodovias.",null,31940]
["Eletropostos","Opção de recargas de boa qualidade, com equipamentos funcionando na normalidade.",null,31940]
{"$rows_left_out":147}