{"text_format":"1","workbook":"xlsx","n_sheets":14,"sheets":["PROJETO","ATRIBUTOS","SEGMENTOS","USUARIOS","PERFIL","APL_2_NOTA","APL_1_NOTA","APL_2_SAT","APL_1_SAT","APL_2_INSAT","APL_1_INSAT","APL_2_FIDEL","APL_1_FIDEL","COMENTARIOS"],"not_rendered":{"charts":0,"images":0,"macros":1,"external_links":0,"defined_names":20,"comments":0,"pivot_tables":0},"unopened":[],"bounds":{"document_bytes":16777216,"sheet_cells":100000,"rows_first":2000,"rows_last":500,"rows_between":2000,"halvings":0,"cell_chars":16384,"cell_head_chars":4096},"cells_cut":0,"cells_raw":0,"read":"whole","date_system":"1900"}

{"sheet":"PROJETO","index":0,"n_rows":3,"n_cols":2,"rows_kept":3,"cut":false,"hidden":false,"merged":[]}
["ID_Projeto",31940]
["Projeto","Pesquisa de Percepção de Valor, Satisfação e Fidelidade\u000bdo Cliente de Recarga em Eletropostos"]
["Data","2024-09-24"]

{"sheet":"ATRIBUTOS","index":1,"n_rows":12,"n_cols":6,"rows_kept":12,"cut":false,"hidden":false,"merged":[]}
["ID_Atributo","Atributo","Grupo","Área / Dimensão","Impacto","Importância"]
[1,"Localização: facilidade de acesso.","Qualidade Percebida","Eletroposto",0.61]
[2,"Tempo de espera para utilizar o carregador (assim que chega).","Qualidade Percebida","Eletroposto",0.68]
[3,"Infraestrutura adequada do eletroposto (vagas, carregadores, entorno e segurança).","Qualidade Percebida","Eletroposto",0.78]
[4,"Informações suficientes e claras para realizar o carregamento.","Qualidade Percebida","Eletroposto",0.8]
[5,"Tempo de carregamento.","Qualidade Percebida","Eletroposto",0.69]
[6,"Facilidade em fazer download do aplicativo.","Qualidade Percebida"," App WeCharge",0.64]
[7,"Facilidade de cadastro.","Qualidade Percebida"," App WeCharge",0.61]
[8,"Facilidade em encontrar os eletropostos e verificar se estão disponíveis.","Qualidade Percebida"," App WeCharge",0.68]
[9,"Facilidade de utilização: útil, prático.","Qualidade Percebida"," App WeCharge",0.74]
[10,"Facilidade de pagamento.","Qualidade Percebida"," App WeCharge",0.7]
[11,"Eficácia do suporte prestado.","Qualidade Percebida"," App WeCharge",0.78]

{"sheet":"SEGMENTOS","index":2,"n_rows":42,"n_cols":3,"rows_kept":42,"cut":false,"hidden":false,"merged":[]}
["ID_Segmento","Segmento","Comparativo"]
[2900,"Mercado"]
[31940,"Todos os Eletropostos",2900]
[31941,"Eletropostos EDP",31940]
[31942,"Eletropostos\nWeCharge + Certaja",31940]
[31944,"Eletropostos de SP e MG",31940]
[31945,"Eletropostos do ES e RJ",31940]
[31946,"Eletropostos do RS e SC",31940]
[31948,"Todos os Eletropostos\nUtiliza alguns dias\nna semana",31940]
[31949,"Todos os Eletropostos\nUtiliza a cada 15 dias",31940]
[31950,"Todos os Eletropostos\nUtiliza a cada mês",31940]
[31951,"Todos os Eletropostos\nUtiliza a cada 2-3 meses",31940]
[31952,"Todos os Eletropostos\nUtliza para a rotina diária",31940]
[31953,"Todos os Eletropostos\nUtiliza para trabalho",31940]
[31954,"Todos os Eletropostos\nUtiliza para passeios",31940]
[31955,"Todos os Eletropostos\nUtiliza para viagens",31940]
[31957,"Todos os Eletropostos\nTrajetos médios\nde 51 a 150 km",31940]
[31958,"Todos os Eletropostos\nTrajetos longos\nmais de 150 km",31940]
[31960,"Eletropostos EDP\nUtiliza alguns\ndias na semana",31941]
[31961,"Eletropostos EDP\nUtiliza a cada 15 dias",31941]
[31962,"Eletropostos EDP\nUtiliza a cada mês",31941]
[31963,"Eletropostos EDP\nUtiliza a cada 2-3 meses",31941]
[31965,"Eletropostos EDP\nUtiliza para trabalho",31941]
[31966,"Eletropostos EDP\nUtiliza para passeios",31941]
[31967,"Eletropostos EDP\nUtiliza para viagens",31941]
[31969,"Eletropostos EDP\nTrajetos médios\nde 51 a 150 km",31941]
[31970,"Eletropostos EDP\nTrajetos longos\nmais de 150 km",31941]
[31974,"RJ - Piraí - EDP Posto Nacional",31945]
[31976,"RS - Tabaí - CERTAJA Casa da Granja",31946]
[31977,"SC - Florianópolis - WECHARGE Beiramar Shopping",31946]
[31978,"SC - Florianópolis - WECHARGE Passeio Primavera",31946]
[31979,"SP - Bertioga - EDP Shopping Riviera",31944]
[31981,"SP - Guaratinguetá - EDP Graal Clube dos 500",31944]
[31982,"SP - Limeira - EDP Graal Topázio",31944]
[31983,"SP - Mairiporã - EDP Graal Mairiporã",31944]
[31984,"SP - Mairiporã - EDP Graal Rancho Português",31944]
[31986,"SP - Pirassununga - EDP Graal Coral",31944]
[31987,"SP - Registro - EDP Graal Buenos Aires",31944]
[31988,"SP - Ribeirão Preto - EDP Graal Trevo",31944]
[31989,"SP - Santa Bárbara d'Oeste - EDP Graal 125 Sul",31944]
[31990,"SP - São Carlos - EDP Graal São Carlos",31944]
[31991,"SP - São José dos Campos - EDP GAP Dutra",31944]

{"sheet":"USUARIOS","index":3,"n_rows":2,"n_cols":44,"rows_kept":2,"cut":false,"hidden":false,"merged":[]}
["ID_Usuario","Segmento","Senha","Visualiza01","Visualiza02","Visualiza03","Visualiza04","Visualiza05","Visualiza06","Visualiza07","Visualiza08","Visualiza09","Visualiza10","Visualiza11","Visualiza12","Visualiza13","Visualiza14","Visualiza15","Visualiza16","Visualiza17","Visualiza18","Visualiza19","Visualiza20","Visualiza21","Visualiza22","Visualiza23","Visualiza24","Visualiza25","Visualiza26","Visualiza27","Visualiza28","Visualiza29","Visualiza30","Visualiza31","Visualiza32","Visualiza33","Visualiza34","Visualiza35","Visualiza36","Visualiza37","Visualiza38","Visualiza39","Visualiza40","Visualiza41"]
[31940,"Todos os Eletropostos","U6P7H",2900,31940,31941,31942,31944,31945,31946,31948,31949,31950,31951,31952,31953,31954,31955,31957,31958,31960,31961,31962,31963,31965,31966,31967,31969,31970,31974,31976,31977,31978,31979,31981,31982,31983,31984,31986,31987,31988,31989,31990,31991]

{"sheet":"PERFIL","index":4,"n_rows":42,"n_cols":22,"rows_kept":42,"cut":false,"hidden":false,"merged":[]}
["ID_SEGMENTO","SEGMENTO_NOME","DATA","Qtd. de respondentes","Frequência média de utilização","Frequência média de utilização","Frequência média de utilização","Frequência média de utilização","Frequência média de utilização","Motivo de utilização","Motivo de utilização","Motivo de utilização","Motivo de utilização","Trajeto médio","Trajeto médio","Trajeto médio","Marca","Marca","Marca","Região","Região","Região"]
["-","-","-","-","A cada 15 dias","A cada 2 ou 3 meses","A cada mês","Alguns dias da semana","Todos os dias da semana","Passeios (curtos)","Rotina diária","Trabalho","Viagens","Trajetos curtos - Até 50 km","Trajetos longos - Mais de 150 km","Trajetos médios - De 51 a 150 km","Certaja","EDP","WeCharge","RJ e ES","RS e SC","SP e MG"]
[31940,{"$f":"_xlfn.XLOOKUP(A3,SEGMENTOS!$A$3:$A$42,SEGMENTOS!$B$3:$B$42)","v":"Todos os Eletropostos"},"2024-09-24",310,68,94,89,52,7,19,11,60,220,5,242,63,13,244,53,32,47,231]
[31941,{"$f":"_xlfn.XLOOKUP(A4,SEGMENTOS!$A$3:$A$42,SEGMENTOS!$B$3:$B$42)","v":"Eletropostos EDP"},"2024-09-24",244,53,71,75,39,6,17,6,47,174,2,194,48,null,null,null,29,2,213]
[31942,{"$f":"_xlfn.XLOOKUP(A5,SEGMENTOS!$A$3:$A$42,SEGMENTOS!$B$3:$B$42)","v":"Eletropostos\nWeCharge + Certaja"},"2024-09-24",66,15,23,14,13,1,2,5,13,66,3,48,15,null,null,null,3,45,18]
[31944,{"$f":"_xlfn.XLOOKUP(A6,SEGMENTOS!$A$3:$A$42,SEGMENTOS!$B$3:$B$42)","v":"Eletropostos de SP e MG"},"2024-09-24",231,56,64,70,38,3,16,3,49,163,2,179,50,null,213,18]
[31945,{"$f":"_xlfn.XLOOKUP(A7,SEGMENTOS!$A$3:$A$42,SEGMENTOS!$B$3:$B$42)","v":"Eletropostos do ES e RJ"},"2024-09-24",32,3,13,9,4,3,2,4,3,23,null,31,1,null,29,3]
[31946,{"$f":"_xlfn.XLOOKUP(A8,SEGMENTOS!$A$3:$A$42,SEGMENTOS!$B$3:$B$42)","v":"Eletropostos do RS e SC"},"2024-09-24",47,9,17,10,10,1,1,4,8,34,3,32,12,13,2,32]
[31948,{"$f":"_xlfn.XLOOKUP(A9,SEGMENTOS!$A$3:$A$42,SEGMENTOS!$B$3:$B$42)","v":"Todos os Eletropostos\nUtiliza alguns dias\nna semana"},"2024-09-24",52,null,null,null,null,null,3,10,20,19,1,30,21,1,39,12,4,10,38]
[31949,{"$f":"_xlfn.XLOOKUP(A10,SEGMENTOS!$A$3:$A$42,SEGMENTOS!$B$3:$B$42)","v":"Todos os Eletropostos\nUtiliza a cada 15 dias"},"2024-09-24",68,null,null,null,null,null,3,1,21,43,1,54,13,3,53,12,3,9,56]
[31950,{"$f":"_xlfn.XLOOKUP(A11,SEGMENTOS!$A$3:$A$42,SEGMENTOS!$B$3:$B$42)","v":"Todos os Eletropostos\nUtiliza a cada mês"},"2024-09-24",89,null,null,null,null,null,7,null,10,72,null,73,16,5,75,9,9,10,70]
[31951,{"$f":"_xlfn.XLOOKUP(A12,SEGMENTOS!$A$3:$A$42,SEGMENTOS!$B$3:$B$42)","v":"Todos os Eletropostos\nUtiliza a cada 2-3 meses"},"2024-09-24",94,null,null,null,null,null,6,null,2,86,3,78,13,4,71,19,13,17,64]
[31952,{"$f":"_xlfn.XLOOKUP(A13,SEGMENTOS!$A$3:$A$42,SEGMENTOS!$B$3:$B$42)","v":"Todos os Eletropostos\nUtliza para a rotina diária"},"2024-09-24",11,1,null,null,10,null,null,null,null,null,null,5,6,1,6,4,4,4,3]
[31953,{"$f":"_xlfn.XLOOKUP(A14,SEGMENTOS!$A$3:$A$42,SEGMENTOS!$B$3:$B$42)","v":"Todos os Eletropostos\nUtiliza para trabalho"},"2024-09-24",60,21,2,10,20,7,null,null,null,null,2,48,10,1,47,12,3,8,49]
[31954,{"$f":"_xlfn.XLOOKUP(A15,SEGMENTOS!$A$3:$A$42,SEGMENTOS!$B$3:$B$42)","v":"Todos os Eletropostos\nUtiliza para passeios"},"2024-09-24",19,3,6,7,3,null,null,null,null,null,2,10,7,null,17,2,2,1,16]
[31955,{"$f":"_xlfn.XLOOKUP(A16,SEGMENTOS!$A$3:$A$42,SEGMENTOS!$B$3:$B$42)","v":"Todos os Eletropostos\nUtiliza para viagens"},"2024-09-24",220,43,86,72,19,null,null,null,null,null,1,179,40,11,174,35,23,34,163]
[31957,{"$f":"_xlfn.XLOOKUP(A17,SEGMENTOS!$A$3:$A$42,SEGMENTOS!$B$3:$B$42)","v":"Todos os Eletropostos\nTrajetos médios\nde 51 a 150 km"},"2024-09-24",63,13,13,16,21,null,7,6,10,40,null,null,null,1,48,14,1,12,50]
[31958,{"$f":"_xlfn.XLOOKUP(A18,SEGMENTOS!$A$3:$A$42,SEGMENTOS!$B$3:$B$42)","v":"Todos os Eletropostos\nTrajetos longos\nmais de 150 km"},"2024-09-24",242,54,78,73,30,7,10,5,48,179,null,null,null,12,194,36,31,32,179]
[31960,{"$f":"_xlfn.XLOOKUP(A19,SEGMENTOS!$A$3:$A$42,SEGMENTOS!$B$3:$B$42)","v":"Eletropostos EDP\nUtiliza alguns\ndias na semana"},"2024-09-24",39,null,null,null,null,null,2,6,14,17,null,24,15,null,null,null,4,1,34]
[31961,{"$f":"_xlfn.XLOOKUP(A20,SEGMENTOS!$A$3:$A$42,SEGMENTOS!$B$3:$B$42)","v":"Eletropostos EDP\nUtiliza a cada 15 dias"},"2024-09-24",53,null,null,null,null,null,3,null,16,34,1,44,8,null,null,null,3,null,50]
[31962,{"$f":"_xlfn.XLOOKUP(A21,SEGMENTOS!$A$3:$A$42,SEGMENTOS!$B$3:$B$42)","v":"Eletropostos EDP\nUtiliza a cada mês"},"2024-09-24",75,null,null,null,null,null,7,null,9,59,null,61,14,null,null,null,9,null,66]
[31963,{"$f":"_xlfn.XLOOKUP(A22,SEGMENTOS!$A$3:$A$42,SEGMENTOS!$B$3:$B$42)","v":"Eletropostos EDP\nUtiliza a cada 2-3 meses"},"2024-09-24",71,null,null,null,null,null,5,null,2,64,1,59,11,null,null,null,10,1,60]
[31965,{"$f":"_xlfn.XLOOKUP(A23,SEGMENTOS!$A$3:$A$42,SEGMENTOS!$B$3:$B$42)","v":"Eletropostos EDP\nUtiliza para trabalho"},"2024-09-24",47,16,2,9,14,6,null,null,null,null,1,40,6,null,null,null,3,1,43]
[31966,{"$f":"_xlfn.XLOOKUP(A24,SEGMENTOS!$A$3:$A$42,SEGMENTOS!$B$3:$B$42)","v":"Eletropostos EDP\nUtiliza para passeios"},"2024-09-24",17,3,5,7,2,null,null,null,null,null,1,9,7,null,null,null,2,null,15]
[31967,{"$f":"_xlfn.XLOOKUP(A25,SEGMENTOS!$A$3:$A$42,SEGMENTOS!$B$3:$B$42)","v":"Eletropostos EDP\nUtiliza para viagens"},"2024-09-24",174,34,64,59,17,null,null,null,null,null,null,142,32,null,null,null,20,1,153]
[31969,{"$f":"_xlfn.XLOOKUP(A26,SEGMENTOS!$A$3:$A$42,SEGMENTOS!$B$3:$B$42)","v":"Eletropostos EDP\nTrajetos médios\nde 51 a 150 km"},"2024-09-24",48,8,11,14,15,null,7,3,6,32,null,null,null,null,null,null,1,null,47]
[31970,{"$f":"_xlfn.XLOOKUP(A27,SEGMENTOS!$A$3:$A$42,SEGMENTOS!$B$3:$B$42)","v":"Eletropostos EDP\nTrajetos longos\nmais de 150 km"},"2024-09-24",194,44,59,61,24,6,9,3,40,142,null,null,null,null,null,null,28,2,164]
[31974,{"$f":"_xlfn.XLOOKUP(A28,SEGMENTOS!$A$3:$A$42,SEGMENTOS!$B$3:$B$42)","v":"RJ - Piraí - EDP Posto Nacional"},"2024-09-24",19,3,8,4,3,1,null,1,3,15,null,18,1]
[31976,{"$f":"_xlfn.XLOOKUP(A29,SEGMENTOS!$A$3:$A$42,SEGMENTOS!$B$3:$B$42)","v":"RS - Tabaí - CERTAJA Casa da Granja"},"2024-09-24",10,2,4,3,1,null,null,1,1,8,null,9,1]
[31977,{"$f":"_xlfn.XLOOKUP(A30,SEGMENTOS!$A$3:$A$42,SEGMENTOS!$B$3:$B$42)","v":"SC - Florianópolis - WECHARGE Beiramar Shopping"},"2024-09-24",34,6,14,5,8,1,1,3,6,24,3,21,10]
[31978,{"$f":"_xlfn.XLOOKUP(A31,SEGMENTOS!$A$3:$A$42,SEGMENTOS!$B$3:$B$42)","v":"SC - Florianópolis - WECHARGE Passeio Primavera"},"2024-09-24",19,6,5,4,4,null,1,1,6,11,null,15,4]
[31979,{"$f":"_xlfn.XLOOKUP(A32,SEGMENTOS!$A$3:$A$42,SEGMENTOS!$B$3:$B$42)","v":"SP - Bertioga - EDP Shopping Riviera"},"2024-09-24",18,2,5,7,3,1,null,null,3,15,null,12,6]
[31981,{"$f":"_xlfn.XLOOKUP(A33,SEGMENTOS!$A$3:$A$42,SEGMENTOS!$B$3:$B$42)","v":"SP - Guaratinguetá - EDP Graal Clube dos 500"},"2024-09-24",32,7,7,8,8,2,1,1,11,19,2,25,5]
[31982,{"$f":"_xlfn.XLOOKUP(A34,SEGMENTOS!$A$3:$A$42,SEGMENTOS!$B$3:$B$42)","v":"SP - Limeira - EDP Graal Topázio"},"2024-09-24",26,4,11,7,4,null,2,null,6,18,null,20,6]
[31983,{"$f":"_xlfn.XLOOKUP(A35,SEGMENTOS!$A$3:$A$42,SEGMENTOS!$B$3:$B$42)","v":"SP - Mairiporã - EDP Graal Mairiporã"},"2024-09-24",10,2,4,3,1,null,1,1,null,8,null,7,3]
[31984,{"$f":"_xlfn.XLOOKUP(A36,SEGMENTOS!$A$3:$A$42,SEGMENTOS!$B$3:$B$42)","v":"SP - Mairiporã - EDP Graal Rancho Português"},"2024-09-24",14,4,5,3,1,1,2,1,2,9,null,10,4]
[31986,{"$f":"_xlfn.XLOOKUP(A37,SEGMENTOS!$A$3:$A$42,SEGMENTOS!$B$3:$B$42)","v":"SP - Pirassununga - EDP Graal Coral"},"2024-09-24",17,3,7,3,4,null,1,null,5,11,null,13,4]
[31987,{"$f":"_xlfn.XLOOKUP(A38,SEGMENTOS!$A$3:$A$42,SEGMENTOS!$B$3:$B$42)","v":"SP - Registro - EDP Graal Buenos Aires"},"2024-09-24",20,5,3,10,2,null,1,1,2,16,null,19,1]
[31988,{"$f":"_xlfn.XLOOKUP(A39,SEGMENTOS!$A$3:$A$42,SEGMENTOS!$B$3:$B$42)","v":"SP - Ribeirão Preto - EDP Graal Trevo"},"2024-09-24",20,3,6,9,2,null,2,null,4,14,null,16,4]
[31989,{"$f":"_xlfn.XLOOKUP(A40,SEGMENTOS!$A$3:$A$42,SEGMENTOS!$B$3:$B$42)","v":"SP - Santa Bárbara d'Oeste - EDP Graal 125 Sul"},"2024-09-24",24,8,4,9,3,null,1,null,5,18,null,21,3]
[31990,{"$f":"_xlfn.XLOOKUP(A41,SEGMENTOS!$A$3:$A$42,SEGMENTOS!$B$3:$B$42)","v":"SP - São Carlos - EDP Graal São Carlos"},"2024-09-24",14,2,4,6,2,null,1,null,1,12,null,10,4]
[31991,{"$f":"_xlfn.XLOOKUP(A42,SEGMENTOS!$A$3:$A$42,SEGMENTOS!$B$3:$B$42)","v":"SP - São José dos Campos - EDP GAP Dutra"},"2024-09-24",12,6,3,2,1,null,2,null,2,8,null,9,3]

{"sheet":"APL_2_NOTA","index":5,"n_rows":42,"n_cols":16,"rows_kept":42,"cut":false,"hidden":false,"merged":[]}
["ID_Segmento","Segmento","Data",1,2,3,4,5,6,7,8,9,10,11,"IQP","I$P"]
[2900,"Mercado","2024-09-24"]
[31940,{"$f":"_xlfn.XLOOKUP(A3,SEGMENTOS!$A$3:$A$42,SEGMENTOS!$B$3:$B$42)","v":"Todos os Eletropostos"},"2024-09-24",8.0935483870967744,6.7864077669902914,7.0849673202614376,7.2312703583061886,7.2138157894736841,8.2755102040816322,7.8775510204081636,6.8549222797927465,7.6185567010309274,7.6439790575916229,7.0915032679738559,7.4090162309059755]
[31941,{"$f":"_xlfn.XLOOKUP(A4,SEGMENTOS!$A$3:$A$42,SEGMENTOS!$B$3:$B$42)","v":"Eletropostos EDP"},"2024-09-24",8.0696721311475414,6.6584362139917692,6.9419087136929463,7.1404958677685952,7.2647058823529411,8.2444444444444436,7.8444444444444441,6.7894736842105265,7.4925373134328357,7.5298507462686564,6.8785046728971961,7.3215270577484022]
[31942,{"$f":"_xlfn.XLOOKUP(A5,SEGMENTOS!$A$3:$A$42,SEGMENTOS!$B$3:$B$42)","v":"Eletropostos\nWeCharge + Certaja"},"2024-09-24",8.1818181818181817,7.2575757575757578,7.615384615384615,7.569230769230769,7.0303030303030303,8.3442622950819665,7.9508196721311473,7,7.9,7.9122807017543861,7.5869565217391308,7.6556556108159981]
[31944,{"$f":"_xlfn.XLOOKUP(A6,SEGMENTOS!$A$3:$A$42,SEGMENTOS!$B$3:$B$42)","v":"Eletropostos de SP e MG"},"2024-09-24",8.1212121212121211,6.7575757575757578,7,7.1754385964912277,7.4755555555555553,8.2518518518518515,7.7555555555555555,6.7424242424242422,7.5338345864661651,7.6015037593984962,7,7.3749141250458736]
[31945,{"$f":"_xlfn.XLOOKUP(A7,SEGMENTOS!$A$3:$A$42,SEGMENTOS!$B$3:$B$42)","v":"Eletropostos do ES e RJ"},"2024-09-24",7.53125,6.625,6.65625,6.75,5.90625,7.7222222222222223,7.7222222222222223,6.666666666666667,7.6111111111111107,7.333333333333333,6,6.9257998270644165]
[31946,{"$f":"_xlfn.XLOOKUP(A8,SEGMENTOS!$A$3:$A$42,SEGMENTOS!$B$3:$B$42)","v":"Eletropostos do RS e SC"},"2024-09-24",8.3404255319148941,7.0434782608695654,7.8043478260869561,7.8297872340425529,6.8510638297872344,8.5813953488372086,8.3255813953488378,7.2790697674418601,7.8837209302325579,7.9249999999999998,7.875,7.7821139469060441]
[31948,{"$f":"_xlfn.XLOOKUP(A9,SEGMENTOS!$A$3:$A$42,SEGMENTOS!$B$3:$B$42)","v":"Todos os Eletropostos\nUtiliza alguns dias\nna semana"},"2024-09-24",7.4807692307692308,5.4038461538461542,6.3269230769230766,6.4230769230769234,6.365384615384615,8.4137931034482758,7.6896551724137927,6.8888888888888893,7.8965517241379306,7.7931034482758621,7.44,7.0772041392918883]
[31949,{"$f":"_xlfn.XLOOKUP(A10,SEGMENTOS!$A$3:$A$42,SEGMENTOS!$B$3:$B$42)","v":"Todos os Eletropostos\nUtiliza a cada 15 dias"},"2024-09-24",8.132352941176471,6.8529411764705879,6.4705882352941178,6.9253731343283578,6.9375,8,7.541666666666667,6.541666666666667,7.2391304347826084,7.479166666666667,6.3529411764705879,7.0961588756371707]
[31950,{"$f":"_xlfn.XLOOKUP(A11,SEGMENTOS!$A$3:$A$42,SEGMENTOS!$B$3:$B$42)","v":"Todos os Eletropostos\nUtiliza a cada mês"},"2024-09-24",8.4494382022471903,7.2584269662921352,7.617977528089888,7.8764044943820224,7.9655172413793105,8.3800000000000008,8.1199999999999992,6.8163265306122449,7.8,7.541666666666667,7.25,7.7155524399351343]
[31951,{"$f":"_xlfn.XLOOKUP(A12,SEGMENTOS!$A$3:$A$42,SEGMENTOS!$B$3:$B$42)","v":"Todos os Eletropostos\nUtiliza a cada 2-3 meses"},"2024-09-24",8.4680851063829792,7.43010752688172,7.802197802197802,7.6521739130434785,7.5531914893617023,8.3939393939393945,8.0303030303030312,7.1515151515151514,7.6060606060606064,7.7777777777777777,7.4117647058823533,7.7334504155818049]
[31952,{"$f":"_xlfn.XLOOKUP(A13,SEGMENTOS!$A$3:$A$42,SEGMENTOS!$B$3:$B$42)","v":"Todos os Eletropostos\nUtliza para a rotina diária"},"2024-09-24",7.9090909090909092,5.1818181818181817,6.6363636363636367,5.4545454545454541,5.8181818181818183,9,9,8.4,9,9.1428571428571423,8,7.5440632000943273]
[31953,{"$f":"_xlfn.XLOOKUP(A14,SEGMENTOS!$A$3:$A$42,SEGMENTOS!$B$3:$B$42)","v":"Todos os Eletropostos\nUtiliza para trabalho"},"2024-09-24",6.55,5.6833333333333336,6.101694915254237,6.2833333333333332,6.4210526315789478,7.6486486486486482,7.5135135135135132,6.5405405405405403,7.5714285714285712,7.3513513513513518,7.03125,6.7750720775317941]
[31954,{"$f":"_xlfn.XLOOKUP(A15,SEGMENTOS!$A$3:$A$42,SEGMENTOS!$B$3:$B$42)","v":"Todos os Eletropostos\nUtiliza para passeios"},"2024-09-24",8.9473684210526319,7.8421052631578947,7.5263157894736841,7.0555555555555554,6.0526315789473681,8.5384615384615383,8.1538461538461533,7.3076923076923075,8.2307692307692299,7.9230769230769234,7.083333333333333,7.6590698119471403]
[31955,{"$f":"_xlfn.XLOOKUP(A16,SEGMENTOS!$A$3:$A$42,SEGMENTOS!$B$3:$B$42)","v":"Todos os Eletropostos\nUtiliza para viagens"},"2024-09-24",8.4499999999999993,7.0776255707762559,7.3364055299539173,7.5963302752293576,7.5944700460829493,8.3812949640287773,7.8920863309352516,6.8405797101449277,7.5035971223021587,7.6194029850746272,7.0849056603773581,7.555018971513654]
[31957,{"$f":"_xlfn.XLOOKUP(A17,SEGMENTOS!$A$3:$A$42,SEGMENTOS!$B$3:$B$42)","v":"Todos os Eletropostos\nTrajetos médios\nde 51 a 150 km"},"2024-09-24",8.1269841269841265,6.3809523809523814,7.1428571428571432,7.4516129032258061,6.9523809523809526,8.0952380952380949,7.7619047619047619,6.7249999999999996,7.8095238095238093,7.8536585365853657,7.225806451612903,7.396604617417605]
[31958,{"$f":"_xlfn.XLOOKUP(A18,SEGMENTOS!$A$3:$A$42,SEGMENTOS!$B$3:$B$42)","v":"Todos os Eletropostos\nTrajetos longos\nmais de 150 km"},"2024-09-24",8.0950413223140494,6.8838174273858925,7.0588235294117645,7.1583333333333332,7.2796610169491522,8.3087248322147644,7.8926174496644297,6.8783783783783781,7.5646258503401365,7.6438356164383565,7.0762711864406782,7.4126930737910577]
[31960,{"$f":"_xlfn.XLOOKUP(A19,SEGMENTOS!$A$3:$A$42,SEGMENTOS!$B$3:$B$42)","v":"Eletropostos EDP\nUtiliza alguns\ndias na semana"},"2024-09-24",7.4102564102564106,5.2820512820512819,5.9487179487179489,6.3076923076923075,6.384615384615385,8.117647058823529,7.117647058823529,6.25,7.3529411764705879,7.1764705882352944,7.0666666666666664,6.7402534953919711]
[31961,{"$f":"_xlfn.XLOOKUP(A20,SEGMENTOS!$A$3:$A$42,SEGMENTOS!$B$3:$B$42)","v":"Eletropostos EDP\nUtiliza a cada 15 dias"},"2024-09-24",8.1509433962264151,6.716981132075472,6.3018867924528301,6.9811320754716979,7.0204081632653059,8.1470588235294112,7.7058823529411766,6.6470588235294121,7.1212121212121211,7.382352941176471,6.0869565217391308,7.069255204991312]
[31962,{"$f":"_xlfn.XLOOKUP(A21,SEGMENTOS!$A$3:$A$42,SEGMENTOS!$B$3:$B$42)","v":"Eletropostos EDP\nUtiliza a cada mês"},"2024-09-24",8.4666666666666668,7.1066666666666665,7.6,7.8266666666666671,7.9726027397260273,8.4210526315789469,8.1842105263157894,6.8648648648648649,7.9473684210526319,7.5945945945945947,7,7.7036119695085228]
[31963,{"$f":"_xlfn.XLOOKUP(A22,SEGMENTOS!$A$3:$A$42,SEGMENTOS!$B$3:$B$42)","v":"Eletropostos EDP\nUtiliza a cada 2-3 meses"},"2024-09-24",8.5070422535211261,7.3428571428571425,7.7352941176470589,7.4782608695652177,7.647887323943662,8.3409090909090917,8,7.0454545454545459,7.4545454545454541,7.7727272727272725,7.4444444444444446,7.6846497141062313]
[31965,{"$f":"_xlfn.XLOOKUP(A23,SEGMENTOS!$A$3:$A$42,SEGMENTOS!$B$3:$B$42)","v":"Eletropostos EDP\nUtiliza para trabalho"},"2024-09-24",6.1702127659574471,5.2553191489361701,5.7234042553191493,5.957446808510638,6.1590909090909092,7.3461538461538458,7.2307692307692308,6.4615384615384617,7.12,7,6.5454545454545459,6.4329235659337476]
[31966,{"$f":"_xlfn.XLOOKUP(A24,SEGMENTOS!$A$3:$A$42,SEGMENTOS!$B$3:$B$42)","v":"Eletropostos EDP\nUtiliza para passeios"},"2024-09-24",9.0588235294117645,7.8235294117647056,7.6470588235294121,7.25,6.1764705882352944,8.545454545454545,8.3636363636363633,7.2727272727272725,8.454545454545455,8.454545454545455,7.2,7.8053517551343132]
[31967,{"$f":"_xlfn.XLOOKUP(A25,SEGMENTOS!$A$3:$A$42,SEGMENTOS!$B$3:$B$42)","v":"Eletropostos EDP\nUtiliza para viagens"},"2024-09-24",8.5172413793103452,6.9826589595375719,7.2397660818713447,7.5317919075144513,7.7192982456140351,8.4375,7.927083333333333,6.8210526315789473,7.458333333333333,7.5263157894736841,6.9594594594594597,7.52688649983053]
[31969,{"$f":"_xlfn.XLOOKUP(A26,SEGMENTOS!$A$3:$A$42,SEGMENTOS!$B$3:$B$42)","v":"Eletropostos EDP\nTrajetos médios\nde 51 a 150 km"},"2024-09-24",8.2708333333333339,6.604166666666667,7.020833333333333,7.5319148936170217,7.1875,8.1428571428571423,7.6785714285714288,6.666666666666667,7.7857142857142856,7.8214285714285712,7.2857142857142856,7.4377658588892945]
[31970,{"$f":"_xlfn.XLOOKUP(A27,SEGMENTOS!$A$3:$A$42,SEGMENTOS!$B$3:$B$42)","v":"Eletropostos EDP\nTrajetos longos\nmais de 150 km"},"2024-09-24",8.0257731958762886,6.6787564766839376,6.9371727748691097,7.0518134715025909,7.2819148936170217,8.2666666666666675,7.8761904761904766,6.8365384615384617,7.4230769230769234,7.490384615384615,6.8095238095238093,7.3029839958610987]
[31974,{"$f":"_xlfn.XLOOKUP(A28,SEGMENTOS!$A$3:$A$42,SEGMENTOS!$B$3:$B$42)","v":"RJ - Piraí - EDP Posto Nacional"},"2024-09-24",7.5789473684210522,6.8421052631578947,7.0526315789473681,7.0526315789473681,6.6842105263157894,7.7222222222222223,7.7222222222222223,6.666666666666667,7.6111111111111107,7.333333333333333,6,7.0898468609916474]
[31976,{"$f":"_xlfn.XLOOKUP(A29,SEGMENTOS!$A$3:$A$42,SEGMENTOS!$B$3:$B$42)","v":"RS - Tabaí - CERTAJA Casa da Granja"},"2024-09-24",8.8000000000000007,8.8000000000000007,8.6,8.4,8.5,8.5813953488372086,8.3255813953488378,7.2790697674418601,7.8837209302325579,7.9249999999999998,7.875,8.2606249811480108]
[31977,{"$f":"_xlfn.XLOOKUP(A30,SEGMENTOS!$A$3:$A$42,SEGMENTOS!$B$3:$B$42)","v":"SC - Florianópolis - WECHARGE Beiramar Shopping"},"2024-09-24",8.2058823529411757,6.4705882352941178,7.6969696969696972,7.882352941176471,6.382352941176471,8.5813953488372086,8.3255813953488378,7.2790697674418601,7.8837209302325579,7.9249999999999998,7.875,7.6735861330654451]
[31978,{"$f":"_xlfn.XLOOKUP(A31,SEGMENTOS!$A$3:$A$42,SEGMENTOS!$B$3:$B$42)","v":"SC - Florianópolis - WECHARGE Passeio Primavera"},"2024-09-24",7.5789473684210522,7.6842105263157894,7.1052631578947372,6.666666666666667,7.2105263157894735,8.5813953488372086,8.3255813953488378,7.2790697674418601,7.8837209302325579,7.9249999999999998,7.875,7.6191363698662382]
[31979,{"$f":"_xlfn.XLOOKUP(A32,SEGMENTOS!$A$3:$A$42,SEGMENTOS!$B$3:$B$42)","v":"SP - Bertioga - EDP Shopping Riviera"},"2024-09-24",8.5,6.4444444444444446,7.2777777777777777,7.7222222222222223,7.2222222222222223,8.2518518518518515,7.7555555555555555,6.7424242424242422,7.5338345864661651,7.6015037593984962,7,7.4394309707505144]
[31981,{"$f":"_xlfn.XLOOKUP(A33,SEGMENTOS!$A$3:$A$42,SEGMENTOS!$B$3:$B$42)","v":"SP - Guaratinguetá - EDP Graal Clube dos 500"},"2024-09-24",7.4375,6.25,6.40625,6.28125,6.419354838709677,8.2518518518518515,7.7555555555555555,6.7424242424242422,7.5338345864661651,7.6015037593984962,7,7.0286793285598108]
[31982,{"$f":"_xlfn.XLOOKUP(A34,SEGMENTOS!$A$3:$A$42,SEGMENTOS!$B$3:$B$42)","v":"SP - Limeira - EDP Graal Topázio"},"2024-09-24",8.8076923076923084,6.7692307692307692,8.16,9,8.8461538461538467,8.2518518518518515,7.7555555555555555,6.7424242424242422,7.5338345864661651,7.6015037593984962,7,7.8595886081844162]
[31983,{"$f":"_xlfn.XLOOKUP(A35,SEGMENTOS!$A$3:$A$42,SEGMENTOS!$B$3:$B$42)","v":"SP - Mairiporã - EDP Graal Mairiporã"},"2024-09-24",8.1,7.2,6.7,5.6,6,8.2518518518518515,7.7555555555555555,6.7424242424242422,7.5338345864661651,7.6015037593984962,7,7.0863829811266488]
[31984,{"$f":"_xlfn.XLOOKUP(A36,SEGMENTOS!$A$3:$A$42,SEGMENTOS!$B$3:$B$42)","v":"SP - Mairiporã - EDP Graal Rancho Português"},"2024-09-24",8.3571428571428577,8,8.0714285714285712,7.3571428571428568,7.5714285714285712,8.2518518518518515,7.7555555555555555,6.7424242424242422,7.5338345864661651,7.6015037593984962,7,7.6389862792552394]
[31986,{"$f":"_xlfn.XLOOKUP(A37,SEGMENTOS!$A$3:$A$42,SEGMENTOS!$B$3:$B$42)","v":"SP - Pirassununga - EDP Graal Coral"},"2024-09-24",7.7058823529411766,6.7647058823529411,5.9375,7.0588235294117645,8.25,8.2518518518518515,7.7555555555555555,6.7424242424242422,7.5338345864661651,7.6015037593984962,7,7.292400757887159]
[31987,{"$f":"_xlfn.XLOOKUP(A38,SEGMENTOS!$A$3:$A$42,SEGMENTOS!$B$3:$B$42)","v":"SP - Registro - EDP Graal Buenos Aires"},"2024-09-24",8.4,6.35,6.25,6.4444444444444446,7.7368421052631575,8.2518518518518515,7.7555555555555555,6.7424242424242422,7.5338345864661651,7.6015037593984962,7,7.2326834491146048]
[31988,{"$f":"_xlfn.XLOOKUP(A39,SEGMENTOS!$A$3:$A$42,SEGMENTOS!$B$3:$B$42)","v":"SP - Ribeirão Preto - EDP Graal Trevo"},"2024-09-24",7.85,7,6.95,7.6,7.9473684210526319,8.2518518518518515,7.7555555555555555,6.7424242424242422,7.5338345864661651,7.6015037593984962,7,7.4560566789899854]
[31989,{"$f":"_xlfn.XLOOKUP(A40,SEGMENTOS!$A$3:$A$42,SEGMENTOS!$B$3:$B$42)","v":"SP - Santa Bárbara d'Oeste - EDP Graal 125 Sul"},"2024-09-24",8.4166666666666661,6.666666666666667,6.5,6.791666666666667,7.8695652173913047,8.2518518518518515,7.7555555555555555,6.7424242424242422,7.5338345864661651,7.6015037593984962,7,7.3351291981608044]
[31990,{"$f":"_xlfn.XLOOKUP(A41,SEGMENTOS!$A$3:$A$42,SEGMENTOS!$B$3:$B$42)","v":"SP - São Carlos - EDP Graal São Carlos"},"2024-09-24",8.4285714285714288,7.6428571428571432,8.5714285714285712,7.5,7.1428571428571432,8.2518518518518515,7.7555555555555555,6.7424242424242422,7.5338345864661651,7.6015037593984962,7,7.640190652054943]
[31991,{"$f":"_xlfn.XLOOKUP(A42,SEGMENTOS!$A$3:$A$42,SEGMENTOS!$B$3:$B$42)","v":"SP - São José dos Campos - EDP GAP Dutra"},"2024-09-24",8.0833333333333339,7.3636363636363633,7.3636363636363633,8.25,6.75,8.2518518518518515,7.7555555555555555,6.7424242424242422,7.5338345864661651,7.6015037593984962,7,7.5087231139726187]

{"sheet":"APL_1_NOTA","index":6,"n_rows":42,"n_cols":16,"rows_kept":42,"cut":false,"hidden":false,"merged":[]}
["ID_Segmento","Segmento","Data",1,2,3,4,5,6,7,8,9,10,11,"IQP","I$P"]
[2900,"Mercado","2022-04-14"]
[31940,{"$f":"_xlfn.XLOOKUP(A3,SEGMENTOS!$A$3:$A$42,SEGMENTOS!$B$3:$B$42)","v":"Todos os Eletropostos"},"2022-04-14"]
[31941,{"$f":"_xlfn.XLOOKUP(A4,SEGMENTOS!$A$3:$A$42,SEGMENTOS!$B$3:$B$42)","v":"Eletropostos EDP"},"2022-04-14",8.1688311688311686,8.1558441558441555,7.662337662337662,7.8051948051948052,7.4155844155844157,8.8405797101449277,0,8.0294117647058822,7.8088235294117645,8.815384615384616,0,8.0485981809047811]
[31942,{"$f":"_xlfn.XLOOKUP(A5,SEGMENTOS!$A$3:$A$42,SEGMENTOS!$B$3:$B$42)","v":"Eletropostos\nWeCharge + Certaja"},"2022-04-14"]
[31944,{"$f":"_xlfn.XLOOKUP(A6,SEGMENTOS!$A$3:$A$42,SEGMENTOS!$B$3:$B$42)","v":"Eletropostos de SP e MG"},"2022-04-14"]
[31945,{"$f":"_xlfn.XLOOKUP(A7,SEGMENTOS!$A$3:$A$42,SEGMENTOS!$B$3:$B$42)","v":"Eletropostos do ES e RJ"},"2022-04-14"]
[31946,{"$f":"_xlfn.XLOOKUP(A8,SEGMENTOS!$A$3:$A$42,SEGMENTOS!$B$3:$B$42)","v":"Eletropostos do RS e SC"},"2022-04-14"]
[31948,{"$f":"_xlfn.XLOOKUP(A9,SEGMENTOS!$A$3:$A$42,SEGMENTOS!$B$3:$B$42)","v":"Todos os Eletropostos\nUtiliza alguns dias\nna semana"},"2022-04-14"]
[31949,{"$f":"_xlfn.XLOOKUP(A10,SEGMENTOS!$A$3:$A$42,SEGMENTOS!$B$3:$B$42)","v":"Todos os Eletropostos\nUtiliza a cada 15 dias"},"2022-04-14"]
[31950,{"$f":"_xlfn.XLOOKUP(A11,SEGMENTOS!$A$3:$A$42,SEGMENTOS!$B$3:$B$42)","v":"Todos os Eletropostos\nUtiliza a cada mês"},"2022-04-14"]
[31951,{"$f":"_xlfn.XLOOKUP(A12,SEGMENTOS!$A$3:$A$42,SEGMENTOS!$B$3:$B$42)","v":"Todos os Eletropostos\nUtiliza a cada 2-3 meses"},"2022-04-14"]
[31952,{"$f":"_xlfn.XLOOKUP(A13,SEGMENTOS!$A$3:$A$42,SEGMENTOS!$B$3:$B$42)","v":"Todos os Eletropostos\nUtliza para a rotina diária"},"2022-04-14"]
[31953,{"$f":"_xlfn.XLOOKUP(A14,SEGMENTOS!$A$3:$A$42,SEGMENTOS!$B$3:$B$42)","v":"Todos os Eletropostos\nUtiliza para trabalho"},"2022-04-14"]
[31954,{"$f":"_xlfn.XLOOKUP(A15,SEGMENTOS!$A$3:$A$42,SEGMENTOS!$B$3:$B$42)","v":"Todos os Eletropostos\nUtiliza para passeios"},"2022-04-14"]
[31955,{"$f":"_xlfn.XLOOKUP(A16,SEGMENTOS!$A$3:$A$42,SEGMENTOS!$B$3:$B$42)","v":"Todos os Eletropostos\nUtiliza para viagens"},"2022-04-14"]
[31957,{"$f":"_xlfn.XLOOKUP(A17,SEGMENTOS!$A$3:$A$42,SEGMENTOS!$B$3:$B$42)","v":"Todos os Eletropostos\nTrajetos médios\nde 51 a 150 km"},"2022-04-14"]
[31958,{"$f":"_xlfn.XLOOKUP(A18,SEGMENTOS!$A$3:$A$42,SEGMENTOS!$B$3:$B$42)","v":"Todos os Eletropostos\nTrajetos longos\nmais de 150 km"},"2022-04-14"]
[31960,{"$f":"_xlfn.XLOOKUP(A19,SEGMENTOS!$A$3:$A$42,SEGMENTOS!$B$3:$B$42)","v":"Eletropostos EDP\nUtiliza alguns\ndias na semana"},"2022-04-14",7.875,7.875,8.375,8.625,7.5,8.625,0,8.125,7.75,9,0,8.1292544570502443]
[31961,{"$f":"_xlfn.XLOOKUP(A20,SEGMENTOS!$A$3:$A$42,SEGMENTOS!$B$3:$B$42)","v":"Eletropostos EDP\nUtiliza a cada 15 dias"},"2022-04-14",7.833333333333333,7.75,5.5,7.416666666666667,7.416666666666667,8,0,7.7272727272727275,7.5454545454545459,8.8181818181818183,0,7.5826457443151121]
[31962,{"$f":"_xlfn.XLOOKUP(A21,SEGMENTOS!$A$3:$A$42,SEGMENTOS!$B$3:$B$42)","v":"Eletropostos EDP\nUtiliza a cada mês"},"2022-04-14",8.03125,7.96875,7.71875,7.53125,7.375,8.8888888888888893,0,8,7.5769230769230766,8.56,0,7.9678004093421437]
[31963,{"$f":"_xlfn.XLOOKUP(A22,SEGMENTOS!$A$3:$A$42,SEGMENTOS!$B$3:$B$42)","v":"Eletropostos EDP\nUtiliza a cada 2-3 meses"},"2022-04-14",8.6,8.68,8.4,8.08,7.44,9.2608695652173907,0,8.1739130434782616,8.2173913043478262,9.0476190476190474,0,8.3508661812431821]
[31965,{"$f":"_xlfn.XLOOKUP(A23,SEGMENTOS!$A$3:$A$42,SEGMENTOS!$B$3:$B$42)","v":"Eletropostos EDP\nUtiliza para trabalho"},"2022-04-14",7.916666666666667,7.666666666666667,7.5,7.5,7.25,8.1818181818181817,0,6.8181818181818183,6.1818181818181817,8.7272727272727266,0,7.4973847060556942]
[31966,{"$f":"_xlfn.XLOOKUP(A24,SEGMENTOS!$A$3:$A$42,SEGMENTOS!$B$3:$B$42)","v":"Eletropostos EDP\nUtiliza para passeios"},"2022-04-14",8.8461538461538467,8.384615384615385,7.5384615384615383,8,7,8.454545454545455,0,7.9090909090909092,7.3636363636363633,8.5833333333333339,0,8.020633337489091]
[31967,{"$f":"_xlfn.XLOOKUP(A25,SEGMENTOS!$A$3:$A$42,SEGMENTOS!$B$3:$B$42)","v":"Eletropostos EDP\nUtiliza para viagens"},"2022-04-14",8.06,8.2200000000000006,7.72,7.84,7.58,9.0888888888888886,0,8.3636363636363633,8.2727272727272734,8.9250000000000007,0,8.1987136106324332]
[31969,{"$f":"_xlfn.XLOOKUP(A26,SEGMENTOS!$A$3:$A$42,SEGMENTOS!$B$3:$B$42)","v":"Eletropostos EDP\nTrajetos médios\nde 51 a 150 km"},"2022-04-14",7.5,6.9444444444444446,6.7222222222222223,6.833333333333333,6.7777777777777777,8.235294117647058,0,6.5294117647058822,6.1764705882352944,7.9333333333333336,0,7.1156078855096867]
[31970,{"$f":"_xlfn.XLOOKUP(A27,SEGMENTOS!$A$3:$A$42,SEGMENTOS!$B$3:$B$42)","v":"Eletropostos EDP\nTrajetos longos\nmais de 150 km"},"2022-04-14",8.3684210526315788,8.526315789473685,7.9298245614035086,8.0877192982456148,7.6491228070175437,9.1,0,8.5714285714285712,8.387755102040817,9.125,0,8.4]
[31974,{"$f":"_xlfn.XLOOKUP(A28,SEGMENTOS!$A$3:$A$42,SEGMENTOS!$B$3:$B$42)","v":"RJ - Piraí - EDP Posto Nacional"},"2022-04-14"]
[31976,{"$f":"_xlfn.XLOOKUP(A29,SEGMENTOS!$A$3:$A$42,SEGMENTOS!$B$3:$B$42)","v":"RS - Tabaí - CERTAJA Casa da Granja"},"2022-04-14"]
[31977,{"$f":"_xlfn.XLOOKUP(A30,SEGMENTOS!$A$3:$A$42,SEGMENTOS!$B$3:$B$42)","v":"SC - Florianópolis - WECHARGE Beiramar Shopping"},"2022-04-14"]
[31978,{"$f":"_xlfn.XLOOKUP(A31,SEGMENTOS!$A$3:$A$42,SEGMENTOS!$B$3:$B$42)","v":"SC - Florianópolis - WECHARGE Passeio Primavera"},"2022-04-14"]
[31979,{"$f":"_xlfn.XLOOKUP(A32,SEGMENTOS!$A$3:$A$42,SEGMENTOS!$B$3:$B$42)","v":"SP - Bertioga - EDP Shopping Riviera"},"2022-04-14"]
[31981,{"$f":"_xlfn.XLOOKUP(A33,SEGMENTOS!$A$3:$A$42,SEGMENTOS!$B$3:$B$42)","v":"SP - Guaratinguetá - EDP Graal Clube dos 500"},"2022-04-14"]
[31982,{"$f":"_xlfn.XLOOKUP(A34,SEGMENTOS!$A$3:$A$42,SEGMENTOS!$B$3:$B$42)","v":"SP - Limeira - EDP Graal Topázio"},"2022-04-14"]
[31983,{"$f":"_xlfn.XLOOKUP(A35,SEGMENTOS!$A$3:$A$42,SEGMENTOS!$B$3:$B$42)","v":"SP - Mairiporã - EDP Graal Mairiporã"},"2022-04-14"]
[31984,{"$f":"_xlfn.XLOOKUP(A36,SEGMENTOS!$A$3:$A$42,SEGMENTOS!$B$3:$B$42)","v":"SP - Mairiporã - EDP Graal Rancho Português"},"2022-04-14"]
[31986,{"$f":"_xlfn.XLOOKUP(A37,SEGMENTOS!$A$3:$A$42,SEGMENTOS!$B$3:$B$42)","v":"SP - Pirassununga - EDP Graal Coral"},"2022-04-14"]
[31987,{"$f":"_xlfn.XLOOKUP(A38,SEGMENTOS!$A$3:$A$42,SEGMENTOS!$B$3:$B$42)","v":"SP - Registro - EDP Graal Buenos Aires"},"2022-04-14"]
[31988,{"$f":"_xlfn.XLOOKUP(A39,SEGMENTOS!$A$3:$A$42,SEGMENTOS!$B$3:$B$42)","v":"SP - Ribeirão Preto - EDP Graal Trevo"},"2022-04-14"]
[31989,{"$f":"_xlfn.XLOOKUP(A40,SEGMENTOS!$A$3:$A$42,SEGMENTOS!$B$3:$B$42)","v":"SP - Santa Bárbara d'Oeste - EDP Graal 125 Sul"},"2022-04-14"]
[31990,{"$f":"_xlfn.XLOOKUP(A41,SEGMENTOS!$A$3:$A$42,SEGMENTOS!$B$3:$B$42)","v":"SP - São Carlos - EDP Graal São Carlos"},"2022-04-14"]
[31991,{"$f":"_xlfn.XLOOKUP(A42,SEGMENTOS!$A$3:$A$42,SEGMENTOS!$B$3:$B$42)","v":"SP - São José dos Campos - EDP GAP Dutra"},"2022-04-14"]

{"sheet":"APL_2_SAT","index":7,"n_rows":42,"n_cols":16,"rows_kept":42,"cut":false,"hidden":false,"merged":[]}
["ID_Segmento","Segmento","Data",1,2,3,4,5,6,7,8,9,10,11,"ISQP","IS$P"]
[2900,"Mercado","2024-09-24"]
[31940,{"$f":"_xlfn.XLOOKUP(A3,SEGMENTOS!$A$3:$A$42,SEGMENTOS!$B$3:$B$42)","v":"Todos os Eletropostos"},"2024-09-24",0.82580645161290323,0.61488673139158578,0.66993464052287577,0.70684039087947881,0.68421052631578949,0.83673469387755106,0.77040816326530615,0.62176165803108807,0.74742268041237114,0.76963350785340312,0.68627450980392157,0.71820738989412125]
[31941,{"$f":"_xlfn.XLOOKUP(A4,SEGMENTOS!$A$3:$A$42,SEGMENTOS!$B$3:$B$42)","v":"Eletropostos EDP"},"2024-09-24",0.81967213114754101,0.59259259259259256,0.65560165975103735,0.69008264462809921,0.70168067226890751,0.81481481481481477,0.75555555555555554,0.61654135338345861,0.72388059701492535,0.74626865671641796,0.66355140186915884,0.7039956320049805]
[31942,{"$f":"_xlfn.XLOOKUP(A5,SEGMENTOS!$A$3:$A$42,SEGMENTOS!$B$3:$B$42)","v":"Eletropostos\nWeCharge + Certaja"},"2024-09-24",0.84848484848484851,0.69696969696969702,0.72307692307692306,0.76923076923076927,0.62121212121212122,0.88524590163934425,0.80327868852459017,0.6333333333333333,0.8,0.82456140350877194,0.73913043478260865,0.75648182825402743]
[31944,{"$f":"_xlfn.XLOOKUP(A6,SEGMENTOS!$A$3:$A$42,SEGMENTOS!$B$3:$B$42)","v":"Eletropostos de SP e MG"},"2024-09-24",0.82251082251082253,0.59740259740259738,0.65350877192982459,0.68859649122807021,0.73333333333333328,0.82222222222222219,0.7407407407407407,0.60606060606060608,0.72180451127819545,0.75187969924812026,0.67289719626168221,0.70688529573956338]
[31945,{"$f":"_xlfn.XLOOKUP(A7,SEGMENTOS!$A$3:$A$42,SEGMENTOS!$B$3:$B$42)","v":"Eletropostos do ES e RJ"},"2024-09-24",0.75,0.65625,0.625,0.625,0.46875,0.72222222222222221,0.72222222222222221,0.61111111111111116,0.83333333333333337,0.77777777777777779,0.6428571428571429,0.67387295925720048]
[31946,{"$f":"_xlfn.XLOOKUP(A8,SEGMENTOS!$A$3:$A$42,SEGMENTOS!$B$3:$B$42)","v":"Eletropostos do RS e SC"},"2024-09-24",0.8936170212765957,0.67391304347826086,0.78260869565217395,0.85106382978723405,0.5957446808510638,0.93023255813953487,0.88372093023255816,0.67441860465116277,0.79069767441860461,0.82499999999999996,0.75,0.78422262823000999]
[31948,{"$f":"_xlfn.XLOOKUP(A9,SEGMENTOS!$A$3:$A$42,SEGMENTOS!$B$3:$B$42)","v":"Todos os Eletropostos\nUtiliza alguns dias\nna semana"},"2024-09-24",0.69230769230769229,0.40384615384615385,0.55769230769230771,0.61538461538461542,0.63461538461538458,0.86206896551724133,0.75862068965517238,0.66666666666666663,0.7931034482758621,0.82758620689655171,0.68,0.67789083957472529]
[31949,{"$f":"_xlfn.XLOOKUP(A10,SEGMENTOS!$A$3:$A$42,SEGMENTOS!$B$3:$B$42)","v":"Todos os Eletropostos\nUtiliza a cada 15 dias"},"2024-09-24",0.83823529411764708,0.58823529411764708,0.57352941176470584,0.64179104477611937,0.59375,0.8125,0.75,0.5625,0.71739130434782605,0.72916666666666663,0.6470588235294118,0.67286497025241632]
[31950,{"$f":"_xlfn.XLOOKUP(A11,SEGMENTOS!$A$3:$A$42,SEGMENTOS!$B$3:$B$42)","v":"Todos os Eletropostos\nUtiliza a cada mês"},"2024-09-24",0.8651685393258427,0.6853932584269663,0.7303370786516854,0.7865168539325843,0.7931034482758621,0.86,0.78,0.65306122448979587,0.78,0.75,0.72499999999999998,0.76237608834979098]
[31951,{"$f":"_xlfn.XLOOKUP(A12,SEGMENTOS!$A$3:$A$42,SEGMENTOS!$B$3:$B$42)","v":"Todos os Eletropostos\nUtiliza a cada 2-3 meses"},"2024-09-24",0.9042553191489362,0.73118279569892475,0.79120879120879117,0.77173913043478259,0.72340425531914898,0.83333333333333337,0.78787878787878785,0.63636363636363635,0.72727272727272729,0.79365079365079361,0.70588235294117652,0.76179966525488618]
[31952,{"$f":"_xlfn.XLOOKUP(A13,SEGMENTOS!$A$3:$A$42,SEGMENTOS!$B$3:$B$42)","v":"Todos os Eletropostos\nUtliza para a rotina diária"},"2024-09-24",0.72727272727272729,0.36363636363636365,0.45454545454545453,0.36363636363636365,0.45454545454545453,1,1,1,1,1,0.66666666666666663,0.71854734111543439]
[31953,{"$f":"_xlfn.XLOOKUP(A14,SEGMENTOS!$A$3:$A$42,SEGMENTOS!$B$3:$B$42)","v":"Todos os Eletropostos\nUtiliza para trabalho"},"2024-09-24",0.6166666666666667,0.48333333333333334,0.52542372881355937,0.58333333333333337,0.57894736842105265,0.7567567567567568,0.72972972972972971,0.56756756756756754,0.74285714285714288,0.70270270270270274,0.6875,0.6321745493770019]
[31954,{"$f":"_xlfn.XLOOKUP(A15,SEGMENTOS!$A$3:$A$42,SEGMENTOS!$B$3:$B$42)","v":"Todos os Eletropostos\nUtiliza para passeios"},"2024-09-24",0.89473684210526316,0.78947368421052633,0.73684210526315785,0.66666666666666663,0.52631578947368418,0.84615384615384615,0.76923076923076927,0.61538461538461542,0.76923076923076927,0.76923076923076927,0.66666666666666663,0.72772798003189143]
[31955,{"$f":"_xlfn.XLOOKUP(A16,SEGMENTOS!$A$3:$A$42,SEGMENTOS!$B$3:$B$42)","v":"Todos os Eletropostos\nUtiliza para viagens"},"2024-09-24",0.88181818181818183,0.64840182648401823,0.7142857142857143,0.76146788990825687,0.73732718894009219,0.84892086330935257,0.76978417266187049,0.62318840579710144,0.73381294964028776,0.77611940298507465,0.68867924528301883,0.7411175165089785]
[31957,{"$f":"_xlfn.XLOOKUP(A17,SEGMENTOS!$A$3:$A$42,SEGMENTOS!$B$3:$B$42)","v":"Todos os Eletropostos\nTrajetos médios\nde 51 a 150 km"},"2024-09-24",0.80952380952380953,0.53968253968253965,0.63492063492063489,0.72580645161290325,0.63492063492063489,0.7857142857142857,0.66666666666666663,0.6,0.76190476190476186,0.78048780487804881,0.58064516129032262,0.68162777794704599]
[31958,{"$f":"_xlfn.XLOOKUP(A18,SEGMENTOS!$A$3:$A$42,SEGMENTOS!$B$3:$B$42)","v":"Todos os Eletropostos\nTrajetos longos\nmais de 150 km"},"2024-09-24",0.83057851239669422,0.63070539419087135,0.67647058823529416,0.7,0.69915254237288138,0.84563758389261745,0.79865771812080533,0.6283783783783784,0.74829931972789121,0.78082191780821919,0.72033898305084743,0.72937259125277709]
[31960,{"$f":"_xlfn.XLOOKUP(A19,SEGMENTOS!$A$3:$A$42,SEGMENTOS!$B$3:$B$42)","v":"Eletropostos EDP\nUtiliza alguns\ndias na semana"},"2024-09-24",0.64102564102564108,0.35897435897435898,0.51282051282051277,0.58974358974358976,0.66666666666666663,0.76470588235294112,0.6470588235294118,0.5625,0.70588235294117652,0.70588235294117652,0.6,0.61193402233686045]
[31961,{"$f":"_xlfn.XLOOKUP(A20,SEGMENTOS!$A$3:$A$42,SEGMENTOS!$B$3:$B$42)","v":"Eletropostos EDP\nUtiliza a cada 15 dias"},"2024-09-24",0.83018867924528306,0.58490566037735847,0.54716981132075471,0.64150943396226412,0.61224489795918369,0.79411764705882348,0.73529411764705888,0.55882352941176472,0.69696969696969702,0.70588235294117652,0.56521739130434778,0.65552651321714739]
[31962,{"$f":"_xlfn.XLOOKUP(A21,SEGMENTOS!$A$3:$A$42,SEGMENTOS!$B$3:$B$42)","v":"Eletropostos EDP\nUtiliza a cada mês"},"2024-09-24",0.8666666666666667,0.65333333333333332,0.73333333333333328,0.77333333333333332,0.79452054794520544,0.84210526315789469,0.76315789473684215,0.67567567567567566,0.76315789473684215,0.72972972972972971,0.70967741935483875,0.75289862020298626]
[31963,{"$f":"_xlfn.XLOOKUP(A22,SEGMENTOS!$A$3:$A$42,SEGMENTOS!$B$3:$B$42)","v":"Eletropostos EDP\nUtiliza a cada 2-3 meses"},"2024-09-24",0.92957746478873238,0.7142857142857143,0.79411764705882348,0.75362318840579712,0.74647887323943662,0.84090909090909094,0.81818181818181823,0.63636363636363635,0.72727272727272729,0.81818181818181823,0.75,0.77250925656423264]
[31965,{"$f":"_xlfn.XLOOKUP(A23,SEGMENTOS!$A$3:$A$42,SEGMENTOS!$B$3:$B$42)","v":"Eletropostos EDP\nUtiliza para trabalho"},"2024-09-24",0.55319148936170215,0.44680851063829785,0.48936170212765956,0.55319148936170215,0.56818181818181823,0.69230769230769229,0.65384615384615385,0.53846153846153844,0.64,0.61538461538461542,0.59090909090909094,0.57469943115360778]
[31966,{"$f":"_xlfn.XLOOKUP(A24,SEGMENTOS!$A$3:$A$42,SEGMENTOS!$B$3:$B$42)","v":"Eletropostos EDP\nUtiliza para passeios"},"2024-09-24",0.88235294117647056,0.76470588235294112,0.76470588235294112,0.6875,0.52941176470588236,0.81818181818181823,0.81818181818181823,0.63636363636363635,0.81818181818181823,0.81818181818181823,0.7,0.74573753095153861]
[31967,{"$f":"_xlfn.XLOOKUP(A25,SEGMENTOS!$A$3:$A$42,SEGMENTOS!$B$3:$B$42)","v":"Eletropostos EDP\nUtiliza para viagens"},"2024-09-24",0.89655172413793105,0.62427745664739887,0.70175438596491224,0.74566473988439308,0.76023391812865493,0.84375,0.77083333333333337,0.63157894736842102,0.72916666666666663,0.76842105263157889,0.68918918918918914,0.7385985076524193]
[31969,{"$f":"_xlfn.XLOOKUP(A26,SEGMENTOS!$A$3:$A$42,SEGMENTOS!$B$3:$B$42)","v":"Eletropostos EDP\nTrajetos médios\nde 51 a 150 km"},"2024-09-24",0.83333333333333337,0.5625,0.625,0.72340425531914898,0.70833333333333337,0.7857142857142857,0.6428571428571429,0.59259259259259256,0.75,0.75,0.61904761904761907,0.68827844920995562]
[31970,{"$f":"_xlfn.XLOOKUP(A27,SEGMENTOS!$A$3:$A$42,SEGMENTOS!$B$3:$B$42)","v":"Eletropostos EDP\nTrajetos longos\nmais de 150 km"},"2024-09-24",0.81958762886597936,0.60103626943005184,0.66492146596858637,0.68393782383419688,0.7021276595744681,0.81904761904761902,0.78095238095238095,0.625,0.72115384615384615,0.75961538461538458,0.6785714285714286,0.71065524807933567]
[31974,{"$f":"_xlfn.XLOOKUP(A28,SEGMENTOS!$A$3:$A$42,SEGMENTOS!$B$3:$B$42)","v":"RJ - Piraí - EDP Posto Nacional"},"2024-09-24",0.73684210526315785,0.63157894736842102,0.73684210526315785,0.68421052631578949,0.63157894736842102,0.72222222222222221,0.72222222222222221,0.61111111111111116,0.83333333333333337,0.77777777777777779,0.6428571428571429,0.70268678613958147]
[31976,{"$f":"_xlfn.XLOOKUP(A29,SEGMENTOS!$A$3:$A$42,SEGMENTOS!$B$3:$B$42)","v":"RS - Tabaí - CERTAJA Casa da Granja"},"2024-09-24",1,1,1,0.9,1,0.93023255813953487,0.88372093023255816,0.67441860465116277,0.79069767441860461,0.82499999999999996,0.75,0.88464844810424381]
[31977,{"$f":"_xlfn.XLOOKUP(A30,SEGMENTOS!$A$3:$A$42,SEGMENTOS!$B$3:$B$42)","v":"SC - Florianópolis - WECHARGE Beiramar Shopping"},"2024-09-24",0.8529411764705882,0.52941176470588236,0.69696969696969702,0.82352941176470584,0.47058823529411764,0.93023255813953487,0.88372093023255816,0.67441860465116277,0.79069767441860461,0.82499999999999996,0.75,0.745538187799202]
[31978,{"$f":"_xlfn.XLOOKUP(A31,SEGMENTOS!$A$3:$A$42,SEGMENTOS!$B$3:$B$42)","v":"SC - Florianópolis - WECHARGE Passeio Primavera"},"2024-09-24",0.73684210526315785,0.78947368421052633,0.63157894736842102,0.61111111111111116,0.68421052631578949,0.93023255813953487,0.88372093023255816,0.67441860465116277,0.79069767441860461,0.82499999999999996,0.75,0.7497511096435221]
[31979,{"$f":"_xlfn.XLOOKUP(A32,SEGMENTOS!$A$3:$A$42,SEGMENTOS!$B$3:$B$42)","v":"SP - Bertioga - EDP Shopping Riviera"},"2024-09-24",0.77777777777777779,0.55555555555555558,0.66666666666666663,0.72222222222222221,0.66666666666666663,0.82222222222222219,0.7407407407407407,0.60606060606060608,0.72180451127819545,0.75187969924812026,0.67289719626168221,0.69850923827483091]
[31981,{"$f":"_xlfn.XLOOKUP(A33,SEGMENTOS!$A$3:$A$42,SEGMENTOS!$B$3:$B$42)","v":"SP - Guaratinguetá - EDP Graal Clube dos 500"},"2024-09-24",0.75,0.53125,0.65625,0.5625,0.61290322580645162,0.82222222222222219,0.7407407407407407,0.60606060606060608,0.72180451127819545,0.75187969924812026,0.67289719626168221,0.67172950102534346]
[31982,{"$f":"_xlfn.XLOOKUP(A34,SEGMENTOS!$A$3:$A$42,SEGMENTOS!$B$3:$B$42)","v":"SP - Limeira - EDP Graal Topázio"},"2024-09-24",0.92307692307692313,0.61538461538461542,0.76,0.88461538461538458,0.96153846153846156,0.82222222222222219,0.7407407407407407,0.60606060606060608,0.72180451127819545,0.75187969924812026,0.67289719626168221,0.76796349348784099]
[31983,{"$f":"_xlfn.XLOOKUP(A35,SEGMENTOS!$A$3:$A$42,SEGMENTOS!$B$3:$B$42)","v":"SP - Mairiporã - EDP Graal Mairiporã"},"2024-09-24",0.8,0.7,0.7,0.5,0.5,0.82222222222222219,0.7407407407407407,0.60606060606060608,0.72180451127819545,0.75187969924812026,0.67289719626168221,0.67840547692593334]
[31984,{"$f":"_xlfn.XLOOKUP(A36,SEGMENTOS!$A$3:$A$42,SEGMENTOS!$B$3:$B$42)","v":"SP - Mairiporã - EDP Graal Rancho Português"},"2024-09-24",0.9285714285714286,0.9285714285714286,0.8571428571428571,0.7857142857142857,0.7142857142857143,0.82222222222222219,0.7407407407407407,0.60606060606060608,0.72180451127819545,0.75187969924812026,0.67289719626168221,0.77345828404099726]
[31986,{"$f":"_xlfn.XLOOKUP(A37,SEGMENTOS!$A$3:$A$42,SEGMENTOS!$B$3:$B$42)","v":"SP - Pirassununga - EDP Graal Coral"},"2024-09-24",0.82352941176470584,0.52941176470588236,0.4375,0.70588235294117652,0.8125,0.82222222222222219,0.7407407407407407,0.60606060606060608,0.72180451127819545,0.75187969924812026,0.67289719626168221,0.68799481849913857]
[31987,{"$f":"_xlfn.XLOOKUP(A38,SEGMENTOS!$A$3:$A$42,SEGMENTOS!$B$3:$B$42)","v":"SP - Registro - EDP Graal Buenos Aires"},"2024-09-24",0.9,0.55000000000000004,0.55000000000000004,0.61111111111111116,0.78947368421052633,0.82222222222222219,0.7407407407407407,0.60606060606060608,0.72180451127819545,0.75187969924812026,0.67289719626168221,0.69534785448678316]
[31988,{"$f":"_xlfn.XLOOKUP(A39,SEGMENTOS!$A$3:$A$42,SEGMENTOS!$B$3:$B$42)","v":"SP - Ribeirão Preto - EDP Graal Trevo"},"2024-09-24",0.8,0.65,0.7,0.8,0.84210526315789469,0.82222222222222219,0.7407407407407407,0.60606060606060608,0.72180451127819545,0.75187969924812026,0.67289719626168221,0.73574044859635457]
[31989,{"$f":"_xlfn.XLOOKUP(A40,SEGMENTOS!$A$3:$A$42,SEGMENTOS!$B$3:$B$42)","v":"SP - Santa Bárbara d'Oeste - EDP Graal 125 Sul"},"2024-09-24",0.83333333333333337,0.54166666666666663,0.58333333333333337,0.625,0.82608695652173914,0.82222222222222219,0.7407407407407407,0.60606060606060608,0.72180451127819545,0.75187969924812026,0.67289719626168221,0.69742839089048159]
[31990,{"$f":"_xlfn.XLOOKUP(A41,SEGMENTOS!$A$3:$A$42,SEGMENTOS!$B$3:$B$42)","v":"SP - São Carlos - EDP Graal São Carlos"},"2024-09-24",0.9285714285714286,0.7142857142857143,0.8571428571428571,0.7142857142857143,0.5714285714285714,0.82222222222222219,0.7407407407407407,0.60606060606060608,0.72180451127819545,0.75187969924812026,0.67289719626168221,0.7343624900813901]
[31991,{"$f":"_xlfn.XLOOKUP(A42,SEGMENTOS!$A$3:$A$42,SEGMENTOS!$B$3:$B$42)","v":"SP - São José dos Campos - EDP GAP Dutra"},"2024-09-24",0.75,0.63636363636363635,0.63636363636363635,0.83333333333333337,0.58333333333333337,0.82222222222222219,0.7407407407407407,0.60606060606060608,0.72180451127819545,0.75187969924812026,0.67289719626168221,0.70444407300343992]

{"sheet":"APL_1_SAT","index":8,"n_rows":42,"n_cols":16,"rows_kept":42,"cut":false,"hidden":false,"merged":[]}
["ID_Segmento","Segmento","Data",1,2,3,4,5,6,7,8,9,10,11,"ISQP","IS$P"]
[2900,"Mercado","2022-04-14"]
[31940,{"$f":"_xlfn.XLOOKUP(A3,SEGMENTOS!$A$3:$A$42,SEGMENTOS!$B$3:$B$42)","v":"Todos os Eletropostos"},"2022-04-14"]
[31941,{"$f":"_xlfn.XLOOKUP(A4,SEGMENTOS!$A$3:$A$42,SEGMENTOS!$B$3:$B$42)","v":"Eletropostos EDP"},"2022-04-14",0.8441558441558441,0.8441558441558441,0.76623376623376627,0.76623376623376627,0.70129870129870131,0.89855072463768115,0,0.83823529411764708,0.76470588235294112,0.89230769230769236,0,0.80721224652278134]
[31942,{"$f":"_xlfn.XLOOKUP(A5,SEGMENTOS!$A$3:$A$42,SEGMENTOS!$B$3:$B$42)","v":"Eletropostos\nWeCharge + Certaja"},"2022-04-14"]
[31944,{"$f":"_xlfn.XLOOKUP(A6,SEGMENTOS!$A$3:$A$42,SEGMENTOS!$B$3:$B$42)","v":"Eletropostos de SP e MG"},"2022-04-14"]
[31945,{"$f":"_xlfn.XLOOKUP(A7,SEGMENTOS!$A$3:$A$42,SEGMENTOS!$B$3:$B$42)","v":"Eletropostos do ES e RJ"},"2022-04-14"]
[31946,{"$f":"_xlfn.XLOOKUP(A8,SEGMENTOS!$A$3:$A$42,SEGMENTOS!$B$3:$B$42)","v":"Eletropostos do RS e SC"},"2022-04-14"]
[31948,{"$f":"_xlfn.XLOOKUP(A9,SEGMENTOS!$A$3:$A$42,SEGMENTOS!$B$3:$B$42)","v":"Todos os Eletropostos\nUtiliza alguns dias\nna semana"},"2022-04-14"]
[31949,{"$f":"_xlfn.XLOOKUP(A10,SEGMENTOS!$A$3:$A$42,SEGMENTOS!$B$3:$B$42)","v":"Todos os Eletropostos\nUtiliza a cada 15 dias"},"2022-04-14"]
[31950,{"$f":"_xlfn.XLOOKUP(A11,SEGMENTOS!$A$3:$A$42,SEGMENTOS!$B$3:$B$42)","v":"Todos os Eletropostos\nUtiliza a cada mês"},"2022-04-14"]
[31951,{"$f":"_xlfn.XLOOKUP(A12,SEGMENTOS!$A$3:$A$42,SEGMENTOS!$B$3:$B$42)","v":"Todos os Eletropostos\nUtiliza a cada 2-3 meses"},"2022-04-14"]
[31952,{"$f":"_xlfn.XLOOKUP(A13,SEGMENTOS!$A$3:$A$42,SEGMENTOS!$B$3:$B$42)","v":"Todos os Eletropostos\nUtliza para a rotina diária"},"2022-04-14"]
[31953,{"$f":"_xlfn.XLOOKUP(A14,SEGMENTOS!$A$3:$A$42,SEGMENTOS!$B$3:$B$42)","v":"Todos os Eletropostos\nUtiliza para trabalho"},"2022-04-14"]
[31954,{"$f":"_xlfn.XLOOKUP(A15,SEGMENTOS!$A$3:$A$42,SEGMENTOS!$B$3:$B$42)","v":"Todos os Eletropostos\nUtiliza para passeios"},"2022-04-14"]
[31955,{"$f":"_xlfn.XLOOKUP(A16,SEGMENTOS!$A$3:$A$42,SEGMENTOS!$B$3:$B$42)","v":"Todos os Eletropostos\nUtiliza para viagens"},"2022-04-14"]
[31957,{"$f":"_xlfn.XLOOKUP(A17,SEGMENTOS!$A$3:$A$42,SEGMENTOS!$B$3:$B$42)","v":"Todos os Eletropostos\nTrajetos médios\nde 51 a 150 km"},"2022-04-14"]
[31958,{"$f":"_xlfn.XLOOKUP(A18,SEGMENTOS!$A$3:$A$42,SEGMENTOS!$B$3:$B$42)","v":"Todos os Eletropostos\nTrajetos longos\nmais de 150 km"},"2022-04-14"]
[31960,{"$f":"_xlfn.XLOOKUP(A19,SEGMENTOS!$A$3:$A$42,SEGMENTOS!$B$3:$B$42)","v":"Eletropostos EDP\nUtiliza alguns\ndias na semana"},"2022-04-14",0.875,1,1,1,0.75,0.875,0,0.875,0.875,1,0,0.90255267423014585]
[31961,{"$f":"_xlfn.XLOOKUP(A20,SEGMENTOS!$A$3:$A$42,SEGMENTOS!$B$3:$B$42)","v":"Eletropostos EDP\nUtiliza a cada 15 dias"},"2022-04-14",0.75,0.75,0.33333333333333331,0.75,0.66666666666666663,0.72727272727272729,0,0.72727272727272729,0.63636363636363635,0.90909090909090906,0,0.70831491577034522]
[31962,{"$f":"_xlfn.XLOOKUP(A21,SEGMENTOS!$A$3:$A$42,SEGMENTOS!$B$3:$B$42)","v":"Eletropostos EDP\nUtiliza a cada mês"},"2022-04-14",0.78125,0.8125,0.78125,0.6875,0.71875,0.88888888888888884,0,0.76923076923076927,0.69230769230769229,0.8,0,0.77065151892947692]
[31963,{"$f":"_xlfn.XLOOKUP(A22,SEGMENTOS!$A$3:$A$42,SEGMENTOS!$B$3:$B$42)","v":"Eletropostos EDP\nUtiliza a cada 2-3 meses"},"2022-04-14",0.96,0.88,0.88,0.8,0.68,1,0,0.95652173913043481,0.86956521739130432,0.95238095238095233,0,0.86790628017602856]
[31965,{"$f":"_xlfn.XLOOKUP(A23,SEGMENTOS!$A$3:$A$42,SEGMENTOS!$B$3:$B$42)","v":"Eletropostos EDP\nUtiliza para trabalho"},"2022-04-14",0.83333333333333337,0.83333333333333337,0.75,0.66666666666666663,0.75,0.81818181818181823,0,0.72727272727272729,0.54545454545454541,0.81818181818181823,0,0.73849516232012202]
[31966,{"$f":"_xlfn.XLOOKUP(A24,SEGMENTOS!$A$3:$A$42,SEGMENTOS!$B$3:$B$42)","v":"Eletropostos EDP\nUtiliza para passeios"},"2022-04-14",0.92307692307692313,0.84615384615384615,0.69230769230769229,0.76923076923076927,0.61538461538461542,0.72727272727272729,0,0.72727272727272729,0.54545454545454541,0.83333333333333337,0,0.75369201301130007]
[31967,{"$f":"_xlfn.XLOOKUP(A25,SEGMENTOS!$A$3:$A$42,SEGMENTOS!$B$3:$B$42)","v":"Eletropostos EDP\nUtiliza para viagens"},"2022-04-14",0.82,0.84,0.78,0.78,0.72,0.9555555555555556,0,0.88636363636363635,0.86363636363636365,0.92500000000000004,0,0.83410127631042297]
[31969,{"$f":"_xlfn.XLOOKUP(A26,SEGMENTOS!$A$3:$A$42,SEGMENTOS!$B$3:$B$42)","v":"Eletropostos EDP\nTrajetos médios\nde 51 a 150 km"},"2022-04-14",0.77777777777777779,0.72222222222222221,0.61111111111111116,0.66666666666666663,0.61111111111111116,0.76470588235294112,0,0.58823529411764708,0.47058823529411764,0.66666666666666663,0,0.65862543828984854]
[31970,{"$f":"_xlfn.XLOOKUP(A27,SEGMENTOS!$A$3:$A$42,SEGMENTOS!$B$3:$B$42)","v":"Eletropostos EDP\nTrajetos longos\nmais de 150 km"},"2022-04-14",0.85964912280701755,0.8771929824561403,0.80701754385964908,0.78947368421052633,0.73684210526315785,0.94,0,0.91836734693877553,0.8571428571428571,0.95833333333333337,0,0.85]
[31974,{"$f":"_xlfn.XLOOKUP(A28,SEGMENTOS!$A$3:$A$42,SEGMENTOS!$B$3:$B$42)","v":"RJ - Piraí - EDP Posto Nacional"},"2022-04-14"]
[31976,{"$f":"_xlfn.XLOOKUP(A29,SEGMENTOS!$A$3:$A$42,SEGMENTOS!$B$3:$B$42)","v":"RS - Tabaí - CERTAJA Casa da Granja"},"2022-04-14"]
[31977,{"$f":"_xlfn.XLOOKUP(A30,SEGMENTOS!$A$3:$A$42,SEGMENTOS!$B$3:$B$42)","v":"SC - Florianópolis - WECHARGE Beiramar Shopping"},"2022-04-14"]
[31978,{"$f":"_xlfn.XLOOKUP(A31,SEGMENTOS!$A$3:$A$42,SEGMENTOS!$B$3:$B$42)","v":"SC - Florianópolis - WECHARGE Passeio Primavera"},"2022-04-14"]
[31979,{"$f":"_xlfn.XLOOKUP(A32,SEGMENTOS!$A$3:$A$42,SEGMENTOS!$B$3:$B$42)","v":"SP - Bertioga - EDP Shopping Riviera"},"2022-04-14"]
[31981,{"$f":"_xlfn.XLOOKUP(A33,SEGMENTOS!$A$3:$A$42,SEGMENTOS!$B$3:$B$42)","v":"SP - Guaratinguetá - EDP Graal Clube dos 500"},"2022-04-14"]
[31982,{"$f":"_xlfn.XLOOKUP(A34,SEGMENTOS!$A$3:$A$42,SEGMENTOS!$B$3:$B$42)","v":"SP - Limeira - EDP Graal Topázio"},"2022-04-14"]
[31983,{"$f":"_xlfn.XLOOKUP(A35,SEGMENTOS!$A$3:$A$42,SEGMENTOS!$B$3:$B$42)","v":"SP - Mairiporã - EDP Graal Mairiporã"},"2022-04-14"]
[31984,{"$f":"_xlfn.XLOOKUP(A36,SEGMENTOS!$A$3:$A$42,SEGMENTOS!$B$3:$B$42)","v":"SP - Mairiporã - EDP Graal Rancho Português"},"2022-04-14"]
[31986,{"$f":"_xlfn.XLOOKUP(A37,SEGMENTOS!$A$3:$A$42,SEGMENTOS!$B$3:$B$42)","v":"SP - Pirassununga - EDP Graal Coral"},"2022-04-14"]
[31987,{"$f":"_xlfn.XLOOKUP(A38,SEGMENTOS!$A$3:$A$42,SEGMENTOS!$B$3:$B$42)","v":"SP - Registro - EDP Graal Buenos Aires"},"2022-04-14"]
[31988,{"$f":"_xlfn.XLOOKUP(A39,SEGMENTOS!$A$3:$A$42,SEGMENTOS!$B$3:$B$42)","v":"SP - Ribeirão Preto - EDP Graal Trevo"},"2022-04-14"]
[31989,{"$f":"_xlfn.XLOOKUP(A40,SEGMENTOS!$A$3:$A$42,SEGMENTOS!$B$3:$B$42)","v":"SP - Santa Bárbara d'Oeste - EDP Graal 125 Sul"},"2022-04-14"]
[31990,{"$f":"_xlfn.XLOOKUP(A41,SEGMENTOS!$A$3:$A$42,SEGMENTOS!$B$3:$B$42)","v":"SP - São Carlos - EDP Graal São Carlos"},"2022-04-14"]
[31991,{"$f":"_xlfn.XLOOKUP(A42,SEGMENTOS!$A$3:$A$42,SEGMENTOS!$B$3:$B$42)","v":"SP - São José dos Campos - EDP GAP Dutra"},"2022-04-14"]

{"sheet":"APL_2_INSAT","index":9,"n_rows":42,"n_cols":16,"rows_kept":42,"cut":false,"hidden":false,"merged":[]}
["ID_Segmento","Segmento","Data",1,2,3,4,5,6,7,8,9,10,11,"IIQP","II$P"]
[2900,"Mercado","2024-09-24"]
[31940,{"$f":"_xlfn.XLOOKUP(A3,SEGMENTOS!$A$3:$A$42,SEGMENTOS!$B$3:$B$42)","v":"Todos os Eletropostos"},"2024-09-24",9.3548387096774197E-2,0.23624595469255663,0.18627450980392157,0.17915309446254071,0.17763157894736842,4.5918367346938778E-2,7.1428571428571425E-2,0.18134715025906736,0.10309278350515463,0.11518324607329843,0.15032679738562091,0.1425864108775991]
[31941,{"$f":"_xlfn.XLOOKUP(A4,SEGMENTOS!$A$3:$A$42,SEGMENTOS!$B$3:$B$42)","v":"Eletropostos EDP"},"2024-09-24",9.4262295081967207E-2,0.23868312757201646,0.2074688796680498,0.19008264462809918,0.18487394957983194,3.7037037037037035E-2,7.407407407407407E-2,0.18796992481203006,0.11194029850746269,0.12686567164179105,0.17757009345794392,0.15150639371020169]
[31942,{"$f":"_xlfn.XLOOKUP(A5,SEGMENTOS!$A$3:$A$42,SEGMENTOS!$B$3:$B$42)","v":"Eletropostos\nWeCharge + Certaja"},"2024-09-24",9.0909090909090912E-2,0.22727272727272727,0.1076923076923077,0.13846153846153847,0.15151515151515152,6.5573770491803282E-2,6.5573770491803282E-2,0.16666666666666666,8.3333333333333329E-2,8.771929824561403E-2,8.6956521739130432E-2,0.11614935073383799]
[31944,{"$f":"_xlfn.XLOOKUP(A6,SEGMENTOS!$A$3:$A$42,SEGMENTOS!$B$3:$B$42)","v":"Eletropostos de SP e MG"},"2024-09-24",9.0909090909090912E-2,0.23376623376623376,0.20175438596491227,0.18859649122807018,0.16888888888888889,4.4444444444444446E-2,7.407407407407407E-2,0.19696969696969696,0.11278195488721804,0.10526315789473684,0.15887850467289719,0.1462816661661149]
[31945,{"$f":"_xlfn.XLOOKUP(A7,SEGMENTOS!$A$3:$A$42,SEGMENTOS!$B$3:$B$42)","v":"Eletropostos do ES e RJ"},"2024-09-24",0.15625,0.25,0.1875,0.21875,0.25,5.5555555555555552E-2,0.16666666666666666,0.22222222222222221,5.5555555555555552E-2,0.22222222222222221,0.2857142857142857,0.19026195108393551]
[31946,{"$f":"_xlfn.XLOOKUP(A8,SEGMENTOS!$A$3:$A$42,SEGMENTOS!$B$3:$B$42)","v":"Eletropostos do RS e SC"},"2024-09-24",6.3829787234042548E-2,0.2391304347826087,0.10869565217391304,0.10638297872340426,0.1702127659574468,4.6511627906976744E-2,2.3255813953488372E-2,0.11627906976744186,9.3023255813953487E-2,0.1,6.25E-2,0.10369534775178116]
[31948,{"$f":"_xlfn.XLOOKUP(A9,SEGMENTOS!$A$3:$A$42,SEGMENTOS!$B$3:$B$42)","v":"Todos os Eletropostos\nUtiliza alguns dias\nna semana"},"2024-09-24",0.19230769230769232,0.38461538461538464,0.28846153846153844,0.32692307692307693,0.30769230769230771,0,0.10344827586206896,0.14814814814814814,6.8965517241379309E-2,0.10344827586206896,0.08,0.18513421174720873]
[31949,{"$f":"_xlfn.XLOOKUP(A10,SEGMENTOS!$A$3:$A$42,SEGMENTOS!$B$3:$B$42)","v":"Todos os Eletropostos\nUtiliza a cada 15 dias"},"2024-09-24",5.8823529411764705E-2,0.23529411764705882,0.27941176470588236,0.19402985074626866,0.1875,8.3333333333333329E-2,0.10416666666666667,0.25,0.15217391304347827,0.10416666666666667,0.23529411764705882,0.17566176187967913]
[31950,{"$f":"_xlfn.XLOOKUP(A11,SEGMENTOS!$A$3:$A$42,SEGMENTOS!$B$3:$B$42)","v":"Todos os Eletropostos\nUtiliza a cada mês"},"2024-09-24",6.741573033707865E-2,0.1797752808988764,0.10112359550561797,0.11235955056179775,0.12643678160919541,0.04,0.04,0.16326530612244897,0.06,0.10416666666666667,0.125,0.10314050396899492]
[31951,{"$f":"_xlfn.XLOOKUP(A12,SEGMENTOS!$A$3:$A$42,SEGMENTOS!$B$3:$B$42)","v":"Todos os Eletropostos\nUtiliza a cada 2-3 meses"},"2024-09-24",3.1914893617021274E-2,0.15053763440860216,8.7912087912087919E-2,9.7826086956521743E-2,8.5106382978723402E-2,3.0303030303030304E-2,4.5454545454545456E-2,0.13636363636363635,0.10606060606060606,0.12698412698412698,0.11764705882352941,9.4212231777013308E-2]
[31952,{"$f":"_xlfn.XLOOKUP(A13,SEGMENTOS!$A$3:$A$42,SEGMENTOS!$B$3:$B$42)","v":"Todos os Eletropostos\nUtliza para a rotina diária"},"2024-09-24",9.0909090909090912E-2,0.45454545454545453,0.27272727272727271,0.54545454545454541,0.36363636363636365,0,0,0,0,0,0,0.16401367763235464]
[31953,{"$f":"_xlfn.XLOOKUP(A14,SEGMENTOS!$A$3:$A$42,SEGMENTOS!$B$3:$B$42)","v":"Todos os Eletropostos\nUtiliza para trabalho"},"2024-09-24",0.3,0.41666666666666669,0.33898305084745761,0.28333333333333333,0.2982456140350877,0.10810810810810811,0.10810810810810811,0.21621621621621623,8.5714285714285715E-2,8.1081081081081086E-2,0.125,0.21569957765145492]
[31954,{"$f":"_xlfn.XLOOKUP(A15,SEGMENTOS!$A$3:$A$42,SEGMENTOS!$B$3:$B$42)","v":"Todos os Eletropostos\nUtiliza para passeios"},"2024-09-24",0,0.10526315789473684,0.15789473684210525,0.33333333333333331,0.36842105263157893,0,0,0.15384615384615385,7.6923076923076927E-2,7.6923076923076927E-2,0.16666666666666666,0.13761331393934301]
[31955,{"$f":"_xlfn.XLOOKUP(A16,SEGMENTOS!$A$3:$A$42,SEGMENTOS!$B$3:$B$42)","v":"Todos os Eletropostos\nUtiliza para viagens"},"2024-09-24",4.5454545454545456E-2,0.18721461187214611,0.14285714285714285,0.11926605504587157,0.11981566820276497,3.5971223021582732E-2,7.1942446043165464E-2,0.18115942028985507,0.11510791366906475,0.13432835820895522,0.16037735849056603,0.12178292638479533]
[31957,{"$f":"_xlfn.XLOOKUP(A17,SEGMENTOS!$A$3:$A$42,SEGMENTOS!$B$3:$B$42)","v":"Todos os Eletropostos\nTrajetos médios\nde 51 a 150 km"},"2024-09-24",0.15873015873015872,0.30158730158730157,0.19047619047619047,0.16129032258064516,0.20634920634920634,9.5238095238095233E-2,0.11904761904761904,0.2,9.5238095238095233E-2,9.7560975609756101E-2,9.6774193548387094E-2,0.15638308351022684]
[31958,{"$f":"_xlfn.XLOOKUP(A18,SEGMENTOS!$A$3:$A$42,SEGMENTOS!$B$3:$B$42)","v":"Todos os Eletropostos\nTrajetos longos\nmais de 150 km"},"2024-09-24",7.8512396694214878E-2,0.22406639004149378,0.18487394957983194,0.18333333333333332,0.17372881355932204,3.3557046979865772E-2,6.0402684563758392E-2,0.17567567567567569,0.10204081632653061,0.11643835616438356,0.16101694915254236,0.13896119542836638]
[31960,{"$f":"_xlfn.XLOOKUP(A19,SEGMENTOS!$A$3:$A$42,SEGMENTOS!$B$3:$B$42)","v":"Eletropostos EDP\nUtiliza alguns\ndias na semana"},"2024-09-24",0.20512820512820512,0.41025641025641024,0.33333333333333331,0.35897435897435898,0.33333333333333331,0,0.17647058823529413,0.25,0.11764705882352941,0.17647058823529413,0.13333333333333333,0.23002819006481173]
[31961,{"$f":"_xlfn.XLOOKUP(A20,SEGMENTOS!$A$3:$A$42,SEGMENTOS!$B$3:$B$42)","v":"Eletropostos EDP\nUtiliza a cada 15 dias"},"2024-09-24",5.6603773584905662E-2,0.24528301886792453,0.30188679245283018,0.18867924528301888,0.20408163265306123,5.8823529411764705E-2,8.8235294117647065E-2,0.20588235294117646,0.15151515151515152,0.11764705882352941,0.2608695652173913,0.17613167029698545]
[31962,{"$f":"_xlfn.XLOOKUP(A21,SEGMENTOS!$A$3:$A$42,SEGMENTOS!$B$3:$B$42)","v":"Eletropostos EDP\nUtiliza a cada mês"},"2024-09-24",6.6666666666666666E-2,0.18666666666666668,0.10666666666666667,0.10666666666666667,0.13698630136986301,2.6315789473684209E-2,2.6315789473684209E-2,0.1891891891891892,2.6315789473684209E-2,8.1081081081081086E-2,0.16129032258064516,0.10301350964325277]
[31963,{"$f":"_xlfn.XLOOKUP(A22,SEGMENTOS!$A$3:$A$42,SEGMENTOS!$B$3:$B$42)","v":"Eletropostos EDP\nUtiliza a cada 2-3 meses"},"2024-09-24",1.4084507042253521E-2,0.12857142857142856,0.10294117647058823,0.11594202898550725,7.0422535211267609E-2,2.2727272727272728E-2,4.5454545454545456E-2,0.13636363636363635,0.13636363636363635,0.13636363636363635,0.1111111111111111,9.5420196353552297E-2]
[31965,{"$f":"_xlfn.XLOOKUP(A23,SEGMENTOS!$A$3:$A$42,SEGMENTOS!$B$3:$B$42)","v":"Eletropostos EDP\nUtiliza para trabalho"},"2024-09-24",0.34042553191489361,0.46808510638297873,0.38297872340425532,0.34042553191489361,0.36363636363636365,0.11538461538461539,0.11538461538461539,0.23076923076923078,0.12,0.11538461538461539,0.18181818181818182,0.25427647551830013]
[31966,{"$f":"_xlfn.XLOOKUP(A24,SEGMENTOS!$A$3:$A$42,SEGMENTOS!$B$3:$B$42)","v":"Eletropostos EDP\nUtiliza para passeios"},"2024-09-24",0,0.11764705882352941,0.17647058823529413,0.3125,0.35294117647058826,0,0,0.18181818181818182,9.0909090909090912E-2,0,0.2,0.13723548138746125]
[31967,{"$f":"_xlfn.XLOOKUP(A25,SEGMENTOS!$A$3:$A$42,SEGMENTOS!$B$3:$B$42)","v":"Eletropostos EDP\nUtiliza para viagens"},"2024-09-24",3.4482758620689655E-2,0.1791907514450867,0.15789473684210525,0.12138728323699421,0.1111111111111111,2.0833333333333332E-2,7.2916666666666671E-2,0.17894736842105263,0.11458333333333333,0.14736842105263157,0.17567567567567569,0.12247624911689173]
[31969,{"$f":"_xlfn.XLOOKUP(A26,SEGMENTOS!$A$3:$A$42,SEGMENTOS!$B$3:$B$42)","v":"Eletropostos EDP\nTrajetos médios\nde 51 a 150 km"},"2024-09-24",0.125,0.25,0.1875,0.14893617021276595,0.1875,3.5714285714285712E-2,0.10714285714285714,0.14814814814814814,7.1428571428571425E-2,0.10714285714285714,9.5238095238095233E-2,0.13386794030714608]
[31970,{"$f":"_xlfn.XLOOKUP(A27,SEGMENTOS!$A$3:$A$42,SEGMENTOS!$B$3:$B$42)","v":"Eletropostos EDP\nTrajetos longos\nmais de 150 km"},"2024-09-24",8.7628865979381437E-2,0.23834196891191708,0.20942408376963351,0.19689119170984457,0.18617021276595744,3.8095238095238099E-2,6.6666666666666666E-2,0.19230769230769232,0.11538461538461539,0.13461538461538461,0.19047619047619047,0.15419597868066012]
[31974,{"$f":"_xlfn.XLOOKUP(A28,SEGMENTOS!$A$3:$A$42,SEGMENTOS!$B$3:$B$42)","v":"RJ - Piraí - EDP Posto Nacional"},"2024-09-24",0.10526315789473684,0.21052631578947367,0.15789473684210525,0.10526315789473684,0.26315789473684209,5.5555555555555552E-2,0.16666666666666666,0.22222222222222221,5.5555555555555552E-2,0.22222222222222221,0.2857142857142857,0.16915342831787639]
[31976,{"$f":"_xlfn.XLOOKUP(A29,SEGMENTOS!$A$3:$A$42,SEGMENTOS!$B$3:$B$42)","v":"RS - Tabaí - CERTAJA Casa da Granja"},"2024-09-24",0,0,0,0,0,4.6511627906976744E-2,2.3255813953488372E-2,0.11627906976744186,9.3023255813953487E-2,0.1,6.25E-2,4.0286701052695072E-2]
[31977,{"$f":"_xlfn.XLOOKUP(A30,SEGMENTOS!$A$3:$A$42,SEGMENTOS!$B$3:$B$42)","v":"SC - Florianópolis - WECHARGE Beiramar Shopping"},"2024-09-24",8.8235294117647065E-2,0.3235294117647059,0.12121212121212122,0.11764705882352941,0.23529411764705882,4.6511627906976744E-2,2.3255813953488372E-2,0.11627906976744186,9.3023255813953487E-2,0.1,6.25E-2,0.12132944712176295]
[31978,{"$f":"_xlfn.XLOOKUP(A31,SEGMENTOS!$A$3:$A$42,SEGMENTOS!$B$3:$B$42)","v":"SC - Florianópolis - WECHARGE Passeio Primavera"},"2024-09-24",0.15789473684210525,0.21052631578947367,0.10526315789473684,0.22222222222222221,0.10526315789473684,4.6511627906976744E-2,2.3255813953488372E-2,0.11627906976744186,9.3023255813953487E-2,0.1,6.25E-2,0.11447454853564802]
[31979,{"$f":"_xlfn.XLOOKUP(A32,SEGMENTOS!$A$3:$A$42,SEGMENTOS!$B$3:$B$42)","v":"SP - Bertioga - EDP Shopping Riviera"},"2024-09-24",5.5555555555555552E-2,0.3888888888888889,0.16666666666666666,0.1111111111111111,0.27777777777777779,4.4444444444444446E-2,7.407407407407407E-2,0.19696969696969696,0.11278195488721804,0.10526315789473684,0.15887850467289719,0.15532114179580148]
[31981,{"$f":"_xlfn.XLOOKUP(A33,SEGMENTOS!$A$3:$A$42,SEGMENTOS!$B$3:$B$42)","v":"SP - Guaratinguetá - EDP Graal Clube dos 500"},"2024-09-24",0.15625,0.3125,0.28125,0.34375,0.29032258064516131,4.4444444444444446E-2,7.407407407407407E-2,0.19696969696969696,0.11278195488721804,0.10526315789473684,0.15887850467289719,0.19340430544771745]
[31982,{"$f":"_xlfn.XLOOKUP(A34,SEGMENTOS!$A$3:$A$42,SEGMENTOS!$B$3:$B$42)","v":"SP - Limeira - EDP Graal Topázio"},"2024-09-24",3.8461538461538464E-2,0.19230769230769232,0.12,0,0,4.4444444444444446E-2,7.407407407407407E-2,0.19696969696969696,0.11278195488721804,0.10526315789473684,0.15887850467289719,9.5521126275941573E-2]
[31983,{"$f":"_xlfn.XLOOKUP(A35,SEGMENTOS!$A$3:$A$42,SEGMENTOS!$B$3:$B$42)","v":"SP - Mairiporã - EDP Graal Mairiporã"},"2024-09-24",0.1,0.2,0.3,0.4,0.4,4.4444444444444446E-2,7.407407407407407E-2,0.19696969696969696,0.11278195488721804,0.10526315789473684,0.15887850467289719,0.19658068928102987]
[31984,{"$f":"_xlfn.XLOOKUP(A36,SEGMENTOS!$A$3:$A$42,SEGMENTOS!$B$3:$B$42)","v":"SP - Mairiporã - EDP Graal Rancho Português"},"2024-09-24",7.1428571428571425E-2,7.1428571428571425E-2,0.14285714285714285,0.14285714285714285,0.14285714285714285,4.4444444444444446E-2,7.407407407407407E-2,0.19696969696969696,0.11278195488721804,0.10526315789473684,0.15887850467289719,0.11738854549744639]
[31986,{"$f":"_xlfn.XLOOKUP(A37,SEGMENTOS!$A$3:$A$42,SEGMENTOS!$B$3:$B$42)","v":"SP - Pirassununga - EDP Graal Coral"},"2024-09-24",0.17647058823529413,0.11764705882352941,0.25,0.17647058823529413,6.25E-2,4.4444444444444446E-2,7.407407407407407E-2,0.19696969696969696,0.11278195488721804,0.10526315789473684,0.15887850467289719,0.13691123784286707]
[31987,{"$f":"_xlfn.XLOOKUP(A38,SEGMENTOS!$A$3:$A$42,SEGMENTOS!$B$3:$B$42)","v":"SP - Registro - EDP Graal Buenos Aires"},"2024-09-24",0.05,0.2,0.25,0.22222222222222221,0.10526315789473684,4.4444444444444446E-2,7.407407407407407E-2,0.19696969696969696,0.11278195488721804,0.10526315789473684,0.15887850467289719,0.1427427329548491]
[31988,{"$f":"_xlfn.XLOOKUP(A39,SEGMENTOS!$A$3:$A$42,SEGMENTOS!$B$3:$B$42)","v":"SP - Ribeirão Preto - EDP Graal Trevo"},"2024-09-24",0.15,0.15,0.2,0.1,5.2631578947368418E-2,4.4444444444444446E-2,7.407407407407407E-2,0.19696969696969696,0.11278195488721804,0.10526315789473684,0.15887850467289719,0.12379415095076841]
[31989,{"$f":"_xlfn.XLOOKUP(A40,SEGMENTOS!$A$3:$A$42,SEGMENTOS!$B$3:$B$42)","v":"SP - Santa Bárbara d'Oeste - EDP Graal 125 Sul"},"2024-09-24",4.1666666666666664E-2,0.29166666666666669,0.33333333333333331,0.25,0.13043478260869565,4.4444444444444446E-2,7.407407407407407E-2,0.19696969696969696,0.11278195488721804,0.10526315789473684,0.15887850467289719,0.16373373727065374]
[31990,{"$f":"_xlfn.XLOOKUP(A41,SEGMENTOS!$A$3:$A$42,SEGMENTOS!$B$3:$B$42)","v":"SP - São Carlos - EDP Graal São Carlos"},"2024-09-24",0,0.14285714285714285,0,0.14285714285714285,0.14285714285714285,4.4444444444444446E-2,7.407407407407407E-2,0.19696969696969696,0.11278195488721804,0.10526315789473684,0.15887850467289719,0.10358458033161354]
[31991,{"$f":"_xlfn.XLOOKUP(A42,SEGMENTOS!$A$3:$A$42,SEGMENTOS!$B$3:$B$42)","v":"SP - São José dos Campos - EDP GAP Dutra"},"2024-09-24",0,9.0909090909090912E-2,9.0909090909090912E-2,8.3333333333333329E-2,0.25,4.4444444444444446E-2,7.407407407407407E-2,0.19696969696969696,0.11278195488721804,0.10526315789473684,0.15887850467289719,0.11161232863173538]

{"sheet":"APL_1_INSAT","index":10,"n_rows":42,"n_cols":16,"rows_kept":42,"cut":false,"hidden":false,"merged":[]}
["ID_Segmento","Segmento","Data",1,2,3,4,5,6,7,8,9,10,11,"IIQP","II$P"]
[2900,"Mercado","2022-04-14"]
[31940,{"$f":"_xlfn.XLOOKUP(A3,SEGMENTOS!$A$3:$A$42,SEGMENTOS!$B$3:$B$42)","v":"Todos os Eletropostos"},"2022-04-14"]
[31941,{"$f":"_xlfn.XLOOKUP(A4,SEGMENTOS!$A$3:$A$42,SEGMENTOS!$B$3:$B$42)","v":"Eletropostos EDP"},"2022-04-14",7.792207792207792E-2,6.4935064935064929E-2,0.16883116883116883,0.11688311688311688,0.12987012987012986,1.4492753623188406E-2,0,0.10294117647058823,0.11764705882352941,3.0769230769230771E-2,0,9.6688269007262143E-2]
[31942,{"$f":"_xlfn.XLOOKUP(A5,SEGMENTOS!$A$3:$A$42,SEGMENTOS!$B$3:$B$42)","v":"Eletropostos\nWeCharge + Certaja"},"2022-04-14"]
[31944,{"$f":"_xlfn.XLOOKUP(A6,SEGMENTOS!$A$3:$A$42,SEGMENTOS!$B$3:$B$42)","v":"Eletropostos de SP e MG"},"2022-04-14"]
[31945,{"$f":"_xlfn.XLOOKUP(A7,SEGMENTOS!$A$3:$A$42,SEGMENTOS!$B$3:$B$42)","v":"Eletropostos do ES e RJ"},"2022-04-14"]
[31946,{"$f":"_xlfn.XLOOKUP(A8,SEGMENTOS!$A$3:$A$42,SEGMENTOS!$B$3:$B$42)","v":"Eletropostos do RS e SC"},"2022-04-14"]
[31948,{"$f":"_xlfn.XLOOKUP(A9,SEGMENTOS!$A$3:$A$42,SEGMENTOS!$B$3:$B$42)","v":"Todos os Eletropostos\nUtiliza alguns dias\nna semana"},"2022-04-14"]
[31949,{"$f":"_xlfn.XLOOKUP(A10,SEGMENTOS!$A$3:$A$42,SEGMENTOS!$B$3:$B$42)","v":"Todos os Eletropostos\nUtiliza a cada 15 dias"},"2022-04-14"]
[31950,{"$f":"_xlfn.XLOOKUP(A11,SEGMENTOS!$A$3:$A$42,SEGMENTOS!$B$3:$B$42)","v":"Todos os Eletropostos\nUtiliza a cada mês"},"2022-04-14"]
[31951,{"$f":"_xlfn.XLOOKUP(A12,SEGMENTOS!$A$3:$A$42,SEGMENTOS!$B$3:$B$42)","v":"Todos os Eletropostos\nUtiliza a cada 2-3 meses"},"2022-04-14"]
[31952,{"$f":"_xlfn.XLOOKUP(A13,SEGMENTOS!$A$3:$A$42,SEGMENTOS!$B$3:$B$42)","v":"Todos os Eletropostos\nUtliza para a rotina diária"},"2022-04-14"]
[31953,{"$f":"_xlfn.XLOOKUP(A14,SEGMENTOS!$A$3:$A$42,SEGMENTOS!$B$3:$B$42)","v":"Todos os Eletropostos\nUtiliza para trabalho"},"2022-04-14"]
[31954,{"$f":"_xlfn.XLOOKUP(A15,SEGMENTOS!$A$3:$A$42,SEGMENTOS!$B$3:$B$42)","v":"Todos os Eletropostos\nUtiliza para passeios"},"2022-04-14"]
[31955,{"$f":"_xlfn.XLOOKUP(A16,SEGMENTOS!$A$3:$A$42,SEGMENTOS!$B$3:$B$42)","v":"Todos os Eletropostos\nUtiliza para viagens"},"2022-04-14"]
[31957,{"$f":"_xlfn.XLOOKUP(A17,SEGMENTOS!$A$3:$A$42,SEGMENTOS!$B$3:$B$42)","v":"Todos os Eletropostos\nTrajetos médios\nde 51 a 150 km"},"2022-04-14"]
[31958,{"$f":"_xlfn.XLOOKUP(A18,SEGMENTOS!$A$3:$A$42,SEGMENTOS!$B$3:$B$42)","v":"Todos os Eletropostos\nTrajetos longos\nmais de 150 km"},"2022-04-14"]
[31960,{"$f":"_xlfn.XLOOKUP(A19,SEGMENTOS!$A$3:$A$42,SEGMENTOS!$B$3:$B$42)","v":"Eletropostos EDP\nUtiliza alguns\ndias na semana"},"2022-04-14",0.125,0,0,0,0.125,0,0,0.125,0.125,0,0,5.6320907617504051E-2]
[31961,{"$f":"_xlfn.XLOOKUP(A20,SEGMENTOS!$A$3:$A$42,SEGMENTOS!$B$3:$B$42)","v":"Eletropostos EDP\nUtiliza a cada 15 dias"},"2022-04-14",8.3333333333333329E-2,0.16666666666666666,0.58333333333333337,0.16666666666666666,0,9.0909090909090912E-2,0,0.18181818181818182,0.18181818181818182,0,0,0.16874171209665537]
[31962,{"$f":"_xlfn.XLOOKUP(A21,SEGMENTOS!$A$3:$A$42,SEGMENTOS!$B$3:$B$42)","v":"Eletropostos EDP\nUtiliza a cada mês"},"2022-04-14",0.125,6.25E-2,0.15625,0.15625,0.15625,0,0,0.15384615384615385,0.19230769230769232,0.08,0,0.11542279640942529]
[31963,{"$f":"_xlfn.XLOOKUP(A22,SEGMENTOS!$A$3:$A$42,SEGMENTOS!$B$3:$B$42)","v":"Eletropostos EDP\nUtiliza a cada 2-3 meses"},"2022-04-14",0,0.04,0.04,0.08,0.16,0,0,0,0,0,0,5.1818975190125918E-2]
[31965,{"$f":"_xlfn.XLOOKUP(A23,SEGMENTOS!$A$3:$A$42,SEGMENTOS!$B$3:$B$42)","v":"Eletropostos EDP\nUtiliza para trabalho"},"2022-04-14",8.3333333333333329E-2,8.3333333333333329E-2,0.25,0.16666666666666666,8.3333333333333329E-2,0,0,0.27272727272727271,0.36363636363636365,0,0,0.14737733903049949]
[31966,{"$f":"_xlfn.XLOOKUP(A24,SEGMENTOS!$A$3:$A$42,SEGMENTOS!$B$3:$B$42)","v":"Eletropostos EDP\nUtiliza para passeios"},"2022-04-14",0,7.6923076923076927E-2,0.23076923076923078,0.23076923076923078,0.15384615384615385,0,0,0,9.0909090909090912E-2,0.16666666666666666,0,0.11025603246024641]
[31967,{"$f":"_xlfn.XLOOKUP(A25,SEGMENTOS!$A$3:$A$42,SEGMENTOS!$B$3:$B$42)","v":"Eletropostos EDP\nUtiliza para viagens"},"2022-04-14",0.1,0.06,0.14000000000000001,0.08,0.14000000000000001,2.2222222222222223E-2,0,9.0909090909090912E-2,6.8181818181818177E-2,0,0,8.1492580658249034E-2]
[31969,{"$f":"_xlfn.XLOOKUP(A26,SEGMENTOS!$A$3:$A$42,SEGMENTOS!$B$3:$B$42)","v":"Eletropostos EDP\nTrajetos médios\nde 51 a 150 km"},"2022-04-14",0.1111111111111111,0.16666666666666666,0.27777777777777779,0.27777777777777779,0.16666666666666666,0,0,0.29411764705882354,0.41176470588235292,0.13333333333333333,0,0.20239404243599116]
[31970,{"$f":"_xlfn.XLOOKUP(A27,SEGMENTOS!$A$3:$A$42,SEGMENTOS!$B$3:$B$42)","v":"Eletropostos EDP\nTrajetos longos\nmais de 150 km"},"2022-04-14",7.0175438596491224E-2,3.5087719298245612E-2,0.14035087719298245,7.0175438596491224E-2,0.12280701754385964,0.02,0,4.0816326530612242E-2,2.0408163265306121E-2,0,0,7.0000000000000007E-2]
[31974,{"$f":"_xlfn.XLOOKUP(A28,SEGMENTOS!$A$3:$A$42,SEGMENTOS!$B$3:$B$42)","v":"RJ - Piraí - EDP Posto Nacional"},"2022-04-14"]
[31976,{"$f":"_xlfn.XLOOKUP(A29,SEGMENTOS!$A$3:$A$42,SEGMENTOS!$B$3:$B$42)","v":"RS - Tabaí - CERTAJA Casa da Granja"},"2022-04-14"]
[31977,{"$f":"_xlfn.XLOOKUP(A30,SEGMENTOS!$A$3:$A$42,SEGMENTOS!$B$3:$B$42)","v":"SC - Florianópolis - WECHARGE Beiramar Shopping"},"2022-04-14"]
[31978,{"$f":"_xlfn.XLOOKUP(A31,SEGMENTOS!$A$3:$A$42,SEGMENTOS!$B$3:$B$42)","v":"SC - Florianópolis - WECHARGE Passeio Primavera"},"2022-04-14"]
[31979,{"$f":"_xlfn.XLOOKUP(A32,SEGMENTOS!$A$3:$A$42,SEGMENTOS!$B$3:$B$42)","v":"SP - Bertioga - EDP Shopping Riviera"},"2022-04-14"]
[31981,{"$f":"_xlfn.XLOOKUP(A33,SEGMENTOS!$A$3:$A$42,SEGMENTOS!$B$3:$B$42)","v":"SP - Guaratinguetá - EDP Graal Clube dos 500"},"2022-04-14"]
[31982,{"$f":"_xlfn.XLOOKUP(A34,SEGMENTOS!$A$3:$A$42,SEGMENTOS!$B$3:$B$42)","v":"SP - Limeira - EDP Graal Topázio"},"2022-04-14"]
[31983,{"$f":"_xlfn.XLOOKUP(A35,SEGMENTOS!$A$3:$A$42,SEGMENTOS!$B$3:$B$42)","v":"SP - Mairiporã - EDP Graal Mairiporã"},"2022-04-14"]
[31984,{"$f":"_xlfn.XLOOKUP(A36,SEGMENTOS!$A$3:$A$42,SEGMENTOS!$B$3:$B$42)","v":"SP - Mairiporã - EDP Graal Rancho Português"},"2022-04-14"]
[31986,{"$f":"_xlfn.XLOOKUP(A37,SEGMENTOS!$A$3:$A$42,SEGMENTOS!$B$3:$B$42)","v":"SP - Pirassununga - EDP Graal Coral"},"2022-04-14"]
[31987,{"$f":"_xlfn.XLOOKUP(A38,SEGMENTOS!$A$3:$A$42,SEGMENTOS!$B$3:$B$42)","v":"SP - Registro - EDP Graal Buenos Aires"},"2022-04-14"]
[31988,{"$f":"_xlfn.XLOOKUP(A39,SEGMENTOS!$A$3:$A$42,SEGMENTOS!$B$3:$B$42)","v":"SP - Ribeirão Preto - EDP Graal Trevo"},"2022-04-14"]
[31989,{"$f":"_xlfn.XLOOKUP(A40,SEGMENTOS!$A$3:$A$42,SEGMENTOS!$B$3:$B$42)","v":"SP - Santa Bárbara d'Oeste - EDP Graal 125 Sul"},"2022-04-14"]
[31990,{"$f":"_xlfn.XLOOKUP(A41,SEGMENTOS!$A$3:$A$42,SEGMENTOS!$B$3:$B$42)","v":"SP - São Carlos - EDP Graal São Carlos"},"2022-04-14"]
[31991,{"$f":"_xlfn.XLOOKUP(A42,SEGMENTOS!$A$3:$A$42,SEGMENTOS!$B$3:$B$42)","v":"SP - São José dos Campos - EDP GAP Dutra"},"2022-04-14"]

{"sheet":"APL_2_FIDEL","index":11,"n_rows":44,"n_cols":24,"rows_kept":44,"cut":false,"hidden":false,"merged":[]}
["ID_Segmento","Segmento","Data","GESEL","GESEL","GESEL","GESEL","GESEL","GESEL","GESEL","GESEL","GESEL","GESEL","GESEL","GESEL","GESEL","GESEL","GESEL","GESEL","GESEL","GESEL","GESEL","GESEL","GESEL"]
["-","-","-","Satisfação geral","Satisfação geral","Satisfação geral","Satisfação geral","Satisfação geral","Propensão a reutilizar","Propensão a reutilizar","Propensão a reutilizar","Propensão a reutilizar","Propensão a reutilizar","Propensão a recomendar","Propensão a recomendar","Propensão a recomendar","Propensão a recomendar","Propensão a recomendar","Nível de Fidelidade","Nível de Fidelidade","Nível de Fidelidade","Nível de Fidelidade","Nível de Fidelidade","IFC"]
["-","-","-","Muito satisfeito","Satisfeito","Nem satisfeito nem insatisfeito","Insatisfeito","Muito insatisfeito","Definitivamente sim","Provavalmente sim","Talvez sim talvez não","Provavelmente não","Definitivamente não","Definitivamente sim","Provavalmente sim","Talvez sim talvez não","Provavelmente não","Definitivamente não","Clientes Prime","Clientes Favoráveis","Clientes Vulneráveis","Clientes Insatisfeitos","Clientes de Alto Risco","IFC"]
[2900,"Mercado","2024-09-24"]
[31940,{"$f":"_xlfn.XLOOKUP(A5,PERFIL!$A$3:$A$42,PERFIL!$B$3:$B$42)","v":"Todos os Eletropostos"},"2024-09-24",0.31147540983606559,0.32786885245901637,0.21639344262295082,0.10163934426229508,4.2622950819672129E-2,0.52131147540983602,0.31475409836065577,9.8360655737704916E-2,3.2786885245901641E-2,3.2786885245901641E-2,0.47540983606557374,0.27868852459016391,0.14426229508196722,6.2295081967213117E-2,3.9344262295081971E-2,0.42622950819672129,0.30163934426229511,0.17049180327868851,6.8852459016393447E-2,3.2786885245901641E-2,0.6262295081967213]
[31941,{"$f":"_xlfn.XLOOKUP(A6,PERFIL!$A$3:$A$42,PERFIL!$B$3:$B$42)","v":"Eletropostos EDP"},"2024-09-24",0.29166666666666669,0.32500000000000001,0.22083333333333333,0.1125,0.05,0.51666666666666672,0.30416666666666664,0.10416666666666667,3.3333333333333333E-2,4.1666666666666664E-2,0.47083333333333333,0.25833333333333336,0.16250000000000001,6.25E-2,4.583333333333333E-2,0.41249999999999998,0.29166666666666669,0.18333333333333332,7.0833333333333331E-2,4.1666666666666664E-2,0.59166666666666667]
[31942,{"$f":"_xlfn.XLOOKUP(A7,PERFIL!$A$3:$A$42,PERFIL!$B$3:$B$42)","v":"Eletropostos\nWeCharge + Certaja"},"2024-09-24",0.38461538461538464,0.33846153846153848,0.2,6.1538461538461542E-2,1.5384615384615385E-2,0.53846153846153844,0.35384615384615387,7.6923076923076927E-2,3.0769230769230771E-2,0,0.49230769230769234,0.35384615384615387,7.6923076923076927E-2,6.1538461538461542E-2,1.5384615384615385E-2,0.47692307692307695,0.33846153846153848,0.12307692307692308,6.1538461538461542E-2,0,0.75384615384615383]
[31944,{"$f":"_xlfn.XLOOKUP(A8,PERFIL!$A$3:$A$42,PERFIL!$B$3:$B$42)","v":"Eletropostos de SP e MG"},"2024-09-24",0.30701754385964913,0.30701754385964913,0.22807017543859648,0.10526315789473684,5.2631578947368418E-2,0.50438596491228072,0.32456140350877194,0.10526315789473684,2.1929824561403508E-2,4.3859649122807015E-2,0.47368421052631576,0.26754385964912281,0.14912280701754385,6.1403508771929821E-2,4.8245614035087717E-2,0.42105263157894735,0.28947368421052633,0.18421052631578946,6.1403508771929821E-2,4.3859649122807015E-2,0.60526315789473684]
[31945,{"$f":"_xlfn.XLOOKUP(A9,PERFIL!$A$3:$A$42,PERFIL!$B$3:$B$42)","v":"Eletropostos do ES e RJ"},"2024-09-24",0.19354838709677419,0.4838709677419355,0.19354838709677419,0.12903225806451613,0,0.67741935483870963,0.12903225806451613,9.6774193548387094E-2,9.6774193548387094E-2,0,0.45161290322580644,0.22580645161290322,0.22580645161290322,9.6774193548387094E-2,0,0.38709677419354838,0.29032258064516131,0.22580645161290322,9.6774193548387094E-2,0,0.58064516129032262]
[31946,{"$f":"_xlfn.XLOOKUP(A10,PERFIL!$A$3:$A$42,PERFIL!$B$3:$B$42)","v":"Eletropostos do RS e SC"},"2024-09-24",0.41304347826086957,0.32608695652173914,0.17391304347826086,6.5217391304347824E-2,2.1739130434782608E-2,0.5,0.39130434782608697,6.5217391304347824E-2,4.3478260869565216E-2,0,0.5,0.36956521739130432,6.5217391304347824E-2,4.3478260869565216E-2,2.1739130434782608E-2,0.47826086956521741,0.36956521739130432,6.5217391304347824E-2,8.6956521739130432E-2,0,0.76086956521739135]
[31948,{"$f":"_xlfn.XLOOKUP(A11,PERFIL!$A$3:$A$42,PERFIL!$B$3:$B$42)","v":"Todos os Eletropostos\nUtiliza alguns dias\nna semana"},"2024-09-24",0.20408163265306123,0.20408163265306123,0.38775510204081631,0.14285714285714285,6.1224489795918366E-2,0.36734693877551022,0.32653061224489793,0.26530612244897961,0,4.0816326530612242E-2,0.24489795918367346,0.30612244897959184,0.26530612244897961,0.12244897959183673,6.1224489795918366E-2,0.18367346938775511,0.36734693877551022,0.30612244897959184,0.10204081632653061,4.0816326530612242E-2,0.40816326530612251]
[31949,{"$f":"_xlfn.XLOOKUP(A12,PERFIL!$A$3:$A$42,PERFIL!$B$3:$B$42)","v":"Todos os Eletropostos\nUtiliza a cada 15 dias"},"2024-09-24",0.3235294117647059,0.30882352941176472,0.16176470588235295,0.14705882352941177,5.8823529411764705E-2,0.55882352941176472,0.25,0.11764705882352941,5.8823529411764705E-2,1.4705882352941176E-2,0.5,0.22058823529411764,0.14705882352941177,7.3529411764705885E-2,5.8823529411764705E-2,0.48529411764705882,0.20588235294117646,0.16176470588235295,8.8235294117647065E-2,5.8823529411764705E-2,0.54411764705882348]
[31950,{"$f":"_xlfn.XLOOKUP(A13,PERFIL!$A$3:$A$42,PERFIL!$B$3:$B$42)","v":"Todos os Eletropostos\nUtiliza a cada mês"},"2024-09-24",0.36363636363636365,0.30681818181818182,0.25,5.6818181818181816E-2,2.2727272727272728E-2,0.5,0.42045454545454547,6.8181818181818177E-2,1.1363636363636364E-2,0,0.54545454545454541,0.31818181818181818,9.0909090909090912E-2,4.5454545454545456E-2,0,0.43181818181818182,0.375,0.18181818181818182,1.1363636363636364E-2,0,0.79545454545454553]
[31951,{"$f":"_xlfn.XLOOKUP(A14,PERFIL!$A$3:$A$42,PERFIL!$B$3:$B$42)","v":"Todos os Eletropostos\nUtiliza a cada 2-3 meses"},"2024-09-24",0.32258064516129031,0.45161290322580644,0.15053763440860216,3.2258064516129031E-2,4.3010752688172046E-2,0.59139784946236562,0.27956989247311825,3.2258064516129031E-2,2.1505376344086023E-2,7.5268817204301078E-2,0.5376344086021505,0.29032258064516131,0.10752688172043011,1.0752688172043012E-2,5.3763440860215055E-2,0.5268817204301075,0.29032258064516131,7.5268817204301078E-2,6.4516129032258063E-2,4.3010752688172046E-2,0.70967741935483875]
[31952,{"$f":"_xlfn.XLOOKUP(A15,PERFIL!$A$3:$A$42,PERFIL!$B$3:$B$42)","v":"Todos os Eletropostos\nUtliza para a rotina diária"},"2024-09-24",0.18181818181818182,9.0909090909090912E-2,0.63636363636363635,9.0909090909090912E-2,0,0.36363636363636365,0,0.63636363636363635,0,0,0.36363636363636365,0,0.63636363636363635,0,0,0.18181818181818182,0.18181818181818182,0.54545454545454541,9.0909090909090912E-2,0,0.27272727272727271]
[31953,{"$f":"_xlfn.XLOOKUP(A16,PERFIL!$A$3:$A$42,PERFIL!$B$3:$B$42)","v":"Todos os Eletropostos\nUtiliza para trabalho"},"2024-09-24",0.2982456140350877,0.21052631578947367,0.2982456140350877,0.15789473684210525,3.5087719298245612E-2,0.49122807017543857,0.33333333333333331,8.771929824561403E-2,7.0175438596491224E-2,1.7543859649122806E-2,0.35087719298245612,0.36842105263157893,0.14035087719298245,0.12280701754385964,1.7543859649122806E-2,0.35087719298245612,0.2807017543859649,0.2807017543859649,7.0175438596491224E-2,1.7543859649122806E-2,0.54385964912280693]
[31954,{"$f":"_xlfn.XLOOKUP(A17,PERFIL!$A$3:$A$42,PERFIL!$B$3:$B$42)","v":"Todos os Eletropostos\nUtiliza para passeios"},"2024-09-24",0.31578947368421051,0.10526315789473684,0.47368421052631576,0.10526315789473684,0,0.68421052631578949,5.2631578947368418E-2,0,0.10526315789473684,0.15789473684210525,0.42105263157894735,0.10526315789473684,0.21052631578947367,0.21052631578947367,5.2631578947368418E-2,0.31578947368421051,0.21052631578947367,0.21052631578947367,0.26315789473684209,0,0.26315789473684209]
[31955,{"$f":"_xlfn.XLOOKUP(A18,PERFIL!$A$3:$A$42,PERFIL!$B$3:$B$42)","v":"Todos os Eletropostos\nUtiliza para viagens"},"2024-09-24",0.32110091743119268,0.38990825688073394,0.15137614678899083,8.7155963302752298E-2,5.0458715596330278E-2,0.52293577981651373,0.34862385321100919,8.2568807339449546E-2,1.834862385321101E-2,2.7522935779816515E-2,0.51834862385321101,0.28440366972477066,0.11467889908256881,3.669724770642202E-2,4.5871559633027525E-2,0.46788990825688076,0.32110091743119268,0.11926605504587157,5.0458715596330278E-2,4.1284403669724773E-2,0.69724770642201839]
[31957,{"$f":"_xlfn.XLOOKUP(A19,PERFIL!$A$3:$A$42,PERFIL!$B$3:$B$42)","v":"Todos os Eletropostos\nTrajetos médios\nde 51 a 150 km"},"2024-09-24",0.23809523809523808,0.2857142857142857,0.34920634920634919,6.3492063492063489E-2,6.3492063492063489E-2,0.42857142857142855,0.31746031746031744,0.14285714285714285,3.1746031746031744E-2,7.9365079365079361E-2,0.44444444444444442,0.26984126984126983,0.12698412698412698,0.1111111111111111,4.7619047619047616E-2,0.33333333333333331,0.33333333333333331,0.12698412698412698,0.17460317460317459,3.1746031746031744E-2,0.46031746031746029]
[31958,{"$f":"_xlfn.XLOOKUP(A20,PERFIL!$A$3:$A$42,PERFIL!$B$3:$B$42)","v":"Todos os Eletropostos\nTrajetos longos\nmais de 150 km"},"2024-09-24",0.32911392405063289,0.34599156118143459,0.17721518987341772,0.10970464135021098,3.7974683544303799E-2,0.54430379746835444,0.32067510548523209,8.8607594936708861E-2,2.5316455696202531E-2,2.1097046413502109E-2,0.48101265822784811,0.28691983122362869,0.15189873417721519,4.6413502109704644E-2,3.3755274261603373E-2,0.4472573839662447,0.29957805907172996,0.18565400843881857,3.3755274261603373E-2,3.3755274261603373E-2,0.67932489451476785]
[31960,{"$f":"_xlfn.XLOOKUP(A21,PERFIL!$A$3:$A$42,PERFIL!$B$3:$B$42)","v":"Eletropostos EDP\nUtiliza alguns\ndias na semana"},"2024-09-24",0.16216216216216217,0.21621621621621623,0.40540540540540543,0.16216216216216217,5.4054054054054057E-2,0.29729729729729731,0.35135135135135137,0.29729729729729731,0,5.4054054054054057E-2,0.16216216216216217,0.35135135135135137,0.29729729729729731,0.13513513513513514,5.4054054054054057E-2,0.13513513513513514,0.3783783783783784,0.35135135135135137,8.1081081081081086E-2,5.4054054054054057E-2,0.37837837837837845]
[31961,{"$f":"_xlfn.XLOOKUP(A22,PERFIL!$A$3:$A$42,PERFIL!$B$3:$B$42)","v":"Eletropostos EDP\nUtiliza a cada 15 dias"},"2024-09-24",0.32075471698113206,0.26415094339622641,0.18867924528301888,0.15094339622641509,7.5471698113207544E-2,0.54716981132075471,0.24528301886792453,0.13207547169811321,5.6603773584905662E-2,1.8867924528301886E-2,0.49056603773584906,0.18867924528301888,0.18867924528301888,5.6603773584905662E-2,7.5471698113207544E-2,0.47169811320754718,0.16981132075471697,0.18867924528301888,9.4339622641509441E-2,7.5471698113207544E-2,0.47169811320754718]
[31962,{"$f":"_xlfn.XLOOKUP(A23,PERFIL!$A$3:$A$42,PERFIL!$B$3:$B$42)","v":"Eletropostos EDP\nUtiliza a cada mês"},"2024-09-24",0.35135135135135137,0.29729729729729731,0.25675675675675674,6.7567567567567571E-2,2.7027027027027029E-2,0.52702702702702697,0.3783783783783784,8.1081081081081086E-2,1.3513513513513514E-2,0,0.55405405405405406,0.28378378378378377,0.10810810810810811,5.4054054054054057E-2,0,0.41891891891891891,0.3783783783783784,0.1891891891891892,1.3513513513513514E-2,0,0.78378378378378388]
[31963,{"$f":"_xlfn.XLOOKUP(A24,PERFIL!$A$3:$A$42,PERFIL!$B$3:$B$42)","v":"Eletropostos EDP\nUtiliza a cada 2-3 meses"},"2024-09-24",0.3,0.48571428571428571,0.12857142857142856,2.8571428571428571E-2,5.7142857142857141E-2,0.6,0.27142857142857141,1.4285714285714285E-2,1.4285714285714285E-2,0.1,0.5714285714285714,0.25714285714285712,0.1,0,7.1428571428571425E-2,0.54285714285714282,0.27142857142857141,5.7142857142857141E-2,7.1428571428571425E-2,5.7142857142857141E-2,0.68571428571428572]
[31965,{"$f":"_xlfn.XLOOKUP(A25,PERFIL!$A$3:$A$42,PERFIL!$B$3:$B$42)","v":"Eletropostos EDP\nUtiliza para trabalho"},"2024-09-24",0.24444444444444444,0.2,0.31111111111111112,0.2,4.4444444444444446E-2,0.44444444444444442,0.33333333333333331,0.1111111111111111,8.8888888888888892E-2,2.2222222222222223E-2,0.28888888888888886,0.35555555555555557,0.17777777777777778,0.15555555555555556,2.2222222222222223E-2,0.28888888888888886,0.26666666666666666,0.33333333333333331,8.8888888888888892E-2,2.2222222222222223E-2,0.44444444444444448]
[31966,{"$f":"_xlfn.XLOOKUP(A26,PERFIL!$A$3:$A$42,PERFIL!$B$3:$B$42)","v":"Eletropostos EDP\nUtiliza para passeios"},"2024-09-24",0.35294117647058826,0.11764705882352941,0.41176470588235292,0.11764705882352941,0,0.70588235294117652,5.8823529411764705E-2,0,5.8823529411764705E-2,0.17647058823529413,0.47058823529411764,0.11764705882352941,0.23529411764705882,0.11764705882352941,5.8823529411764705E-2,0.35294117647058826,0.23529411764705882,0.17647058823529413,0.23529411764705882,0,0.35294117647058826]
[31967,{"$f":"_xlfn.XLOOKUP(A27,PERFIL!$A$3:$A$42,PERFIL!$B$3:$B$42)","v":"Eletropostos EDP\nUtiliza para viagens"},"2024-09-24",0.30813953488372092,0.38372093023255816,0.15697674418604651,9.3023255813953487E-2,5.8139534883720929E-2,0.52906976744186052,0.33139534883720928,8.7209302325581398E-2,1.7441860465116279E-2,3.4883720930232558E-2,0.52906976744186052,0.2558139534883721,0.12790697674418605,3.4883720930232558E-2,5.232558139534884E-2,0.46511627906976744,0.30813953488372092,0.12209302325581395,5.232558139534884E-2,5.232558139534884E-2,0.66860465116279078]
[31969,{"$f":"_xlfn.XLOOKUP(A28,PERFIL!$A$3:$A$42,PERFIL!$B$3:$B$42)","v":"Eletropostos EDP\nTrajetos médios\nde 51 a 150 km"},"2024-09-24",0.20833333333333334,0.3125,0.35416666666666669,6.25E-2,6.25E-2,0.41666666666666669,0.3125,0.14583333333333334,2.0833333333333332E-2,0.10416666666666667,0.4375,0.27083333333333331,0.125,0.125,4.1666666666666664E-2,0.33333333333333331,0.33333333333333331,0.10416666666666667,0.1875,4.1666666666666664E-2,0.43749999999999994]
[31970,{"$f":"_xlfn.XLOOKUP(A29,PERFIL!$A$3:$A$42,PERFIL!$B$3:$B$42)","v":"Eletropostos EDP\nTrajetos longos\nmais de 150 km"},"2024-09-24",0.31052631578947371,0.33157894736842103,0.18947368421052632,0.12105263157894737,4.736842105263158E-2,0.54210526315789476,0.30526315789473685,9.4736842105263161E-2,3.1578947368421054E-2,2.6315789473684209E-2,0.47894736842105262,0.25789473684210529,0.1736842105263158,4.736842105263158E-2,4.2105263157894736E-2,0.43157894736842106,0.28421052631578947,0.20526315789473684,3.6842105263157891E-2,4.2105263157894736E-2,0.63684210526315788]
[31974,{"$f":"_xlfn.XLOOKUP(A30,PERFIL!$A$3:$A$42,PERFIL!$B$3:$B$42)","v":"RJ - Piraí - EDP Posto Nacional"},"2024-09-24",0.21052631578947367,0.42105263157894735,0.31578947368421051,5.2631578947368418E-2,0,0.42105263157894735,0.42105263157894735,0.10526315789473684,5.2631578947368418E-2,0,0.31578947368421051,0.42105263157894735,0.21052631578947367,5.2631578947368418E-2,0,0.26315789473684209,0.42105263157894735,0.26315789473684209,5.2631578947368418E-2,0,0.63157894736842102]
[31976,{"$f":"_xlfn.XLOOKUP(A31,PERFIL!$A$3:$A$42,PERFIL!$B$3:$B$42)","v":"RS - Tabaí - CERTAJA Casa da Granja"},"2024-09-24",0.5,0.5,0,0,0,0.5,0.5,0,0,0,0.5,0.5,0,0,0,0.5,0.5,0,0,0,1]
[31977,{"$f":"_xlfn.XLOOKUP(A32,PERFIL!$A$3:$A$42,PERFIL!$B$3:$B$42)","v":"SC - Florianópolis - WECHARGE Beiramar Shopping"},"2024-09-24",0.35294117647058826,0.26470588235294118,0.26470588235294118,8.8235294117647065E-2,2.9411764705882353E-2,0.52941176470588236,0.3235294117647059,8.8235294117647065E-2,5.8823529411764705E-2,0,0.5,0.3235294117647059,8.8235294117647065E-2,5.8823529411764705E-2,2.9411764705882353E-2,0.47058823529411764,0.3235294117647059,8.8235294117647065E-2,0.11764705882352941,0,0.67647058823529416]
[31978,{"$f":"_xlfn.XLOOKUP(A33,PERFIL!$A$3:$A$42,PERFIL!$B$3:$B$42)","v":"SC - Florianópolis - WECHARGE Passeio Primavera"},"2024-09-24",0.33333333333333331,0.3888888888888889,0.22222222222222221,5.5555555555555552E-2,0,0.61111111111111116,0.27777777777777779,0.1111111111111111,0,0,0.44444444444444442,0.33333333333333331,0.1111111111111111,0.1111111111111111,0,0.44444444444444442,0.27777777777777779,0.27777777777777779,0,0,0.72222222222222221]
[31979,{"$f":"_xlfn.XLOOKUP(A34,PERFIL!$A$3:$A$42,PERFIL!$B$3:$B$42)","v":"SP - Bertioga - EDP Shopping Riviera"},"2024-09-24",0.33333333333333331,0.27777777777777779,0.27777777777777779,0.1111111111111111,0,0.61111111111111116,0.27777777777777779,0.1111111111111111,0,0,0.61111111111111116,0.16666666666666666,0.16666666666666666,5.5555555555555552E-2,0,0.55555555555555558,0.22222222222222221,0.16666666666666666,5.5555555555555552E-2,0,0.72222222222222221]
[31981,{"$f":"_xlfn.XLOOKUP(A35,PERFIL!$A$3:$A$42,PERFIL!$B$3:$B$42)","v":"SP - Guaratinguetá - EDP Graal Clube dos 500"},"2024-09-24",0.25806451612903225,0.32258064516129031,0.16129032258064516,0.19354838709677419,6.4516129032258063E-2,0.45161290322580644,0.29032258064516131,0.12903225806451613,6.4516129032258063E-2,6.4516129032258063E-2,0.32258064516129031,0.32258064516129031,0.16129032258064516,9.6774193548387094E-2,9.6774193548387094E-2,0.32258064516129031,0.32258064516129031,0.19354838709677419,9.6774193548387094E-2,6.4516129032258063E-2,0.48387096774193544]
[31982,{"$f":"_xlfn.XLOOKUP(A36,PERFIL!$A$3:$A$42,PERFIL!$B$3:$B$42)","v":"SP - Limeira - EDP Graal Topázio"},"2024-09-24",0.53846153846153844,0.34615384615384615,7.6923076923076927E-2,0,3.8461538461538464E-2,0.65384615384615385,0.26923076923076922,3.8461538461538464E-2,0,3.8461538461538464E-2,0.65384615384615385,0.23076923076923078,7.6923076923076927E-2,0,3.8461538461538464E-2,0.61538461538461542,0.23076923076923078,0.11538461538461539,0,3.8461538461538464E-2,0.80769230769230782]
[31983,{"$f":"_xlfn.XLOOKUP(A37,PERFIL!$A$3:$A$42,PERFIL!$B$3:$B$42)","v":"SP - Mairiporã - EDP Graal Mairiporã"},"2024-09-24",0.1,0.3,0.3,0.2,0.1,0.5,0.2,0.2,0,0.1,0.4,0.1,0.4,0,0.1,0.3,0.2,0.3,0.1,0.1,0.30000000000000004]
[31984,{"$f":"_xlfn.XLOOKUP(A38,PERFIL!$A$3:$A$42,PERFIL!$B$3:$B$42)","v":"SP - Mairiporã - EDP Graal Rancho Português"},"2024-09-24",0.21428571428571427,0.35714285714285715,0.21428571428571427,0.21428571428571427,0,0.6428571428571429,0.21428571428571427,0.14285714285714285,0,0,0.5,0.14285714285714285,0.2857142857142857,7.1428571428571425E-2,0,0.42857142857142855,0.21428571428571427,0.2857142857142857,7.1428571428571425E-2,0,0.5714285714285714]
[31986,{"$f":"_xlfn.XLOOKUP(A39,PERFIL!$A$3:$A$42,PERFIL!$B$3:$B$42)","v":"SP - Pirassununga - EDP Graal Coral"},"2024-09-24",0.41176470588235292,0.29411764705882354,0.23529411764705882,5.8823529411764705E-2,0,0.47058823529411764,0.41176470588235292,0.11764705882352941,0,0,0.47058823529411764,0.35294117647058826,5.8823529411764705E-2,0.11764705882352941,0,0.47058823529411764,0.29411764705882354,0.17647058823529413,5.8823529411764705E-2,0,0.70588235294117641]
[31987,{"$f":"_xlfn.XLOOKUP(A40,PERFIL!$A$3:$A$42,PERFIL!$B$3:$B$42)","v":"SP - Registro - EDP Graal Buenos Aires"},"2024-09-24",0.15,0.4,0.25,0.15,0.05,0.35,0.45,0.1,0.05,0.05,0.35,0.4,0.2,0,0.05,0.25,0.5,0.1,0.1,0.05,0.6]
[31988,{"$f":"_xlfn.XLOOKUP(A41,PERFIL!$A$3:$A$42,PERFIL!$B$3:$B$42)","v":"SP - Ribeirão Preto - EDP Graal Trevo"},"2024-09-24",0.3,0.4,0.2,0,0.1,0.35,0.5,0.05,0.05,0.05,0.4,0.45,0,0.1,0.05,0.35,0.45,0.1,0.05,0.05,0.7]
[31989,{"$f":"_xlfn.XLOOKUP(A42,PERFIL!$A$3:$A$42,PERFIL!$B$3:$B$42)","v":"SP - Santa Bárbara d'Oeste - EDP Graal 125 Sul"},"2024-09-24",0.33333333333333331,0.29166666666666669,0.16666666666666666,0.125,8.3333333333333329E-2,0.54166666666666663,0.25,8.3333333333333329E-2,4.1666666666666664E-2,8.3333333333333329E-2,0.54166666666666663,0.20833333333333334,0.125,4.1666666666666664E-2,8.3333333333333329E-2,0.5,0.25,8.3333333333333329E-2,8.3333333333333329E-2,8.3333333333333329E-2,0.58333333333333326]
[31990,{"$f":"_xlfn.XLOOKUP(A43,PERFIL!$A$3:$A$42,PERFIL!$B$3:$B$42)","v":"SP - São Carlos - EDP Graal São Carlos"},"2024-09-24",0.2857142857142857,0.21428571428571427,0.35714285714285715,7.1428571428571425E-2,7.1428571428571425E-2,0.5714285714285714,0.2857142857142857,0.14285714285714285,0,0,0.5714285714285714,0.21428571428571427,0.14285714285714285,7.1428571428571425E-2,0,0.42857142857142855,0.21428571428571427,0.2857142857142857,7.1428571428571425E-2,0,0.5714285714285714]
[31991,{"$f":"_xlfn.XLOOKUP(A44,PERFIL!$A$3:$A$42,PERFIL!$B$3:$B$42)","v":"SP - São José dos Campos - EDP GAP Dutra"},"2024-09-24",0.54545454545454541,9.0909090909090912E-2,0.36363636363636365,0,0,0.63636363636363635,9.0909090909090912E-2,0.18181818181818182,0,9.0909090909090912E-2,0.63636363636363635,0,0.36363636363636365,0,0,0.63636363636363635,0,0.27272727272727271,9.0909090909090912E-2,0,0.54545454545454541]

{"sheet":"APL_1_FIDEL","index":12,"n_rows":44,"n_cols":24,"rows_kept":44,"cut":false,"hidden":false,"merged":[]}
["ID_Segmento","Segmento","Data","GESEL","GESEL","GESEL","GESEL","GESEL","GESEL","GESEL","GESEL","GESEL","GESEL","GESEL","GESEL","GESEL","GESEL","GESEL","GESEL","GESEL","GESEL","GESEL","GESEL","GESEL"]
["-","-","-","Satisfação geral","Satisfação geral","Satisfação geral","Satisfação geral","Satisfação geral","Propensão a reutilizar","Propensão a reutilizar","Propensão a reutilizar","Propensão a reutilizar","Propensão a reutilizar","Propensão a recomendar","Propensão a recomendar","Propensão a recomendar","Propensão a recomendar","Propensão a recomendar","Nível de Fidelidade","Nível de Fidelidade","Nível de Fidelidade","Nível de Fidelidade","Nível de Fidelidade","IFC"]
["-","-","-","Muito satisfeito","Satisfeito","Nem satisfeito nem insatisfeito","Insatisfeito","Muito insatisfeito","Definitivamente sim","Provavalmente sim","Talvez sim talvez não","Provavelmente não","Definitivamente não","Definitivamente sim","Provavalmente sim","Talvez sim talvez não","Provavelmente não","Definitivamente não","Clientes Prime","Clientes Favoráveis","Clientes Vulneráveis","Clientes Insatisfeitos","Clientes de Alto Risco","IFC"]
[2900,"Mercado","2022-04-14"]
[31940,{"$f":"_xlfn.XLOOKUP(A5,PERFIL!$A$3:$A$42,PERFIL!$B$3:$B$42)","v":"Todos os Eletropostos"},"2022-04-14"]
[31941,{"$f":"_xlfn.XLOOKUP(A6,PERFIL!$A$3:$A$42,PERFIL!$B$3:$B$42)","v":"Eletropostos EDP"},"2022-04-14",0.35064935064934999,0.48051948051948001,0.103896103896103,5.1948051948051903E-2,1.2987012987012899E-2,0.77922077922077904,0.19480519480519401,1.2987012987012899E-2,0,1.2987012987012899E-2,0.75324675324675305,0.168831168831168,6.4935064935064901E-2,0,1.2987012987012899E-2,0.70129870129870098,0.207792207792207,7.7922077922077906E-2,0,1.2987012987012899E-2,0.89610389610389596]
[31942,{"$f":"_xlfn.XLOOKUP(A7,PERFIL!$A$3:$A$42,PERFIL!$B$3:$B$42)","v":"Eletropostos\nWeCharge + Certaja"},"2022-04-14"]
[31944,{"$f":"_xlfn.XLOOKUP(A8,PERFIL!$A$3:$A$42,PERFIL!$B$3:$B$42)","v":"Eletropostos de SP e MG"},"2022-04-14"]
[31945,{"$f":"_xlfn.XLOOKUP(A9,PERFIL!$A$3:$A$42,PERFIL!$B$3:$B$42)","v":"Eletropostos do ES e RJ"},"2022-04-14"]
[31946,{"$f":"_xlfn.XLOOKUP(A10,PERFIL!$A$3:$A$42,PERFIL!$B$3:$B$42)","v":"Eletropostos do RS e SC"},"2022-04-14"]
[31948,{"$f":"_xlfn.XLOOKUP(A11,PERFIL!$A$3:$A$42,PERFIL!$B$3:$B$42)","v":"Todos os Eletropostos\nUtiliza alguns dias\nna semana"},"2022-04-14"]
[31949,{"$f":"_xlfn.XLOOKUP(A12,PERFIL!$A$3:$A$42,PERFIL!$B$3:$B$42)","v":"Todos os Eletropostos\nUtiliza a cada 15 dias"},"2022-04-14"]
[31950,{"$f":"_xlfn.XLOOKUP(A13,PERFIL!$A$3:$A$42,PERFIL!$B$3:$B$42)","v":"Todos os Eletropostos\nUtiliza a cada mês"},"2022-04-14"]
[31951,{"$f":"_xlfn.XLOOKUP(A14,PERFIL!$A$3:$A$42,PERFIL!$B$3:$B$42)","v":"Todos os Eletropostos\nUtiliza a cada 2-3 meses"},"2022-04-14"]
[31952,{"$f":"_xlfn.XLOOKUP(A15,PERFIL!$A$3:$A$42,PERFIL!$B$3:$B$42)","v":"Todos os Eletropostos\nUtliza para a rotina diária"},"2022-04-14"]
[31953,{"$f":"_xlfn.XLOOKUP(A16,PERFIL!$A$3:$A$42,PERFIL!$B$3:$B$42)","v":"Todos os Eletropostos\nUtiliza para trabalho"},"2022-04-14"]
[31954,{"$f":"_xlfn.XLOOKUP(A17,PERFIL!$A$3:$A$42,PERFIL!$B$3:$B$42)","v":"Todos os Eletropostos\nUtiliza para passeios"},"2022-04-14"]
[31955,{"$f":"_xlfn.XLOOKUP(A18,PERFIL!$A$3:$A$42,PERFIL!$B$3:$B$42)","v":"Todos os Eletropostos\nUtiliza para viagens"},"2022-04-14"]
[31957,{"$f":"_xlfn.XLOOKUP(A19,PERFIL!$A$3:$A$42,PERFIL!$B$3:$B$42)","v":"Todos os Eletropostos\nTrajetos médios\nde 51 a 150 km"},"2022-04-14"]
[31958,{"$f":"_xlfn.XLOOKUP(A20,PERFIL!$A$3:$A$42,PERFIL!$B$3:$B$42)","v":"Todos os Eletropostos\nTrajetos longos\nmais de 150 km"},"2022-04-14"]
[31960,{"$f":"_xlfn.XLOOKUP(A21,PERFIL!$A$3:$A$42,PERFIL!$B$3:$B$42)","v":"Eletropostos EDP\nUtiliza alguns\ndias na semana"},"2022-04-14",0.375,0.5,0.125,0,0,0.75,0.25,0,0,0,0.75,0.125,0.125,0,0,0.75,0.125,0.125,0,0,0.875]
[31961,{"$f":"_xlfn.XLOOKUP(A22,PERFIL!$A$3:$A$42,PERFIL!$B$3:$B$42)","v":"Eletropostos EDP\nUtiliza a cada 15 dias"},"2022-04-14",0.375,0.375,0.15625,6.25E-2,3.125E-2,0.6875,0.25,3.125E-2,0,3.125E-2,0.6875,0.21875,6.25E-2,0,3.125E-2,0.625,0.25,9.375E-2,0,3.125E-2,0.84375]
[31962,{"$f":"_xlfn.XLOOKUP(A23,PERFIL!$A$3:$A$42,PERFIL!$B$3:$B$42)","v":"Eletropostos EDP\nUtiliza a cada mês"},"2022-04-14",0.16666666666666599,0.66666666666666596,8.3333333333333301E-2,8.3333333333333301E-2,0,0.75,0.25,0,0,0,0.66666666666666596,0.25,8.3333333333333301E-2,0,0,0.58333333333333304,0.33333333333333298,8.3333333333333301E-2,0,0,0.91666666666666596]
[31963,{"$f":"_xlfn.XLOOKUP(A24,PERFIL!$A$3:$A$42,PERFIL!$B$3:$B$42)","v":"Eletropostos EDP\nUtiliza a cada 2-3 meses"},"2022-04-14",0.4,0.52,0.04,0.04,0,0.92,0.08,0,0,0,0.88,0.08,0.04,0,0,0.84,0.12,0.04,0,0,0.96]
[31965,{"$f":"_xlfn.XLOOKUP(A25,PERFIL!$A$3:$A$42,PERFIL!$B$3:$B$42)","v":"Eletropostos EDP\nUtiliza para trabalho"},"2022-04-14",0.41666666666666602,0.41666666666666602,0,0.16666666666666599,0,0.75,0.25,0,0,0,0.75,0.16666666666666599,8.3333333333333301E-2,0,0,0.58333333333333304,0.25,0.16666666666666599,0,0,0.83333333333333304]
[31966,{"$f":"_xlfn.XLOOKUP(A26,PERFIL!$A$3:$A$42,PERFIL!$B$3:$B$42)","v":"Eletropostos EDP\nUtiliza para passeios"},"2022-04-14",0.30769230769230699,0.46153846153846101,0.15384615384615299,7.69230769230769E-2,0,0.69230769230769196,0.23076923076923,7.69230769230769E-2,0,0,0.69230769230769196,0.15384615384615299,0.15384615384615299,0,0,0.61538461538461497,0.23076923076923,0.15384615384615299,0,0,0.84615384615384603]
[31967,{"$f":"_xlfn.XLOOKUP(A27,PERFIL!$A$3:$A$42,PERFIL!$B$3:$B$42)","v":"Eletropostos EDP\nUtiliza para viagens"},"2022-04-14",0.34,0.5,0.12,0.02,0.02,0.8,0.18,0,0,0.02,0.76,0.18,0.04,0,0.02,0.74,0.2,0.04,0,0.02,0.91999999999999904]
[31969,{"$f":"_xlfn.XLOOKUP(A28,PERFIL!$A$3:$A$42,PERFIL!$B$3:$B$42)","v":"Eletropostos EDP\nTrajetos médios\nde 51 a 150 km"},"2022-04-14",0.16666666666666599,0.44444444444444398,0.16666666666666599,0.16666666666666599,5.5555555555555497E-2,0.66666666666666596,0.22222222222222199,5.5555555555555497E-2,0,5.5555555555555497E-2,0.55555555555555503,0.22222222222222199,0.16666666666666599,0,5.5555555555555497E-2,0.5,0.22222222222222199,0.22222222222222199,0,5.5555555555555497E-2,0.66666666666666596]
[31970,{"$f":"_xlfn.XLOOKUP(A29,PERFIL!$A$3:$A$42,PERFIL!$B$3:$B$42)","v":"Eletropostos EDP\nTrajetos longos\nmais de 150 km"},"2022-04-14",0.42105263157894701,0.47368421052631499,8.7719298245614002E-2,1.7543859649122799E-2,0,0.84210526315789402,0.157894736842105,0,0,0,0.84210526315789402,0.122807017543859,3.5087719298245598E-2,0,0,0.78947368421052599,0.175438596491228,3.5087719298245598E-2,0,0,0.96491228070175405]
[31974,{"$f":"_xlfn.XLOOKUP(A30,PERFIL!$A$3:$A$42,PERFIL!$B$3:$B$42)","v":"RJ - Piraí - EDP Posto Nacional"},"2022-04-14"]
[31976,{"$f":"_xlfn.XLOOKUP(A31,PERFIL!$A$3:$A$42,PERFIL!$B$3:$B$42)","v":"RS - Tabaí - CERTAJA Casa da Granja"},"2022-04-14"]
[31977,{"$f":"_xlfn.XLOOKUP(A32,PERFIL!$A$3:$A$42,PERFIL!$B$3:$B$42)","v":"SC - Florianópolis - WECHARGE Beiramar Shopping"},"2022-04-14"]
[31978,{"$f":"_xlfn.XLOOKUP(A33,PERFIL!$A$3:$A$42,PERFIL!$B$3:$B$42)","v":"SC - Florianópolis - WECHARGE Passeio Primavera"},"2022-04-14"]
[31979,{"$f":"_xlfn.XLOOKUP(A34,PERFIL!$A$3:$A$42,PERFIL!$B$3:$B$42)","v":"SP - Bertioga - EDP Shopping Riviera"},"2022-04-14"]
[31981,{"$f":"_xlfn.XLOOKUP(A35,PERFIL!$A$3:$A$42,PERFIL!$B$3:$B$42)","v":"SP - Guaratinguetá - EDP Graal Clube dos 500"},"2022-04-14"]
[31982,{"$f":"_xlfn.XLOOKUP(A36,PERFIL!$A$3:$A$42,PERFIL!$B$3:$B$42)","v":"SP - Limeira - EDP Graal Topázio"},"2022-04-14"]
[31983,{"$f":"_xlfn.XLOOKUP(A37,PERFIL!$A$3:$A$42,PERFIL!$B$3:$B$42)","v":"SP - Mairiporã - EDP Graal Mairiporã"},"2022-04-14"]
[31984,{"$f":"_xlfn.XLOOKUP(A38,PERFIL!$A$3:$A$42,PERFIL!$B$3:$B$42)","v":"SP - Mairiporã - EDP Graal Rancho Português"},"2022-04-14"]
[31986,{"$f":"_xlfn.XLOOKUP(A39,PERFIL!$A$3:$A$42,PERFIL!$B$3:$B$42)","v":"SP - Pirassununga - EDP Graal Coral"},"2022-04-14"]
[31987,{"$f":"_xlfn.XLOOKUP(A40,PERFIL!$A$3:$A$42,PERFIL!$B$3:$B$42)","v":"SP - Registro - EDP Graal Buenos Aires"},"2022-04-14"]
[31988,{"$f":"_xlfn.XLOOKUP(A41,PERFIL!$A$3:$A$42,PERFIL!$B$3:$B$42)","v":"SP - Ribeirão Preto - EDP Graal Trevo"},"2022-04-14"]
[31989,{"$f":"_xlfn.XLOOKUP(A42,PERFIL!$A$3:$A$42,PERFIL!$B$3:$B$42)","v":"SP - Santa Bárbara d'Oeste - EDP Graal 125 Sul"},"2022-04-14"]
[31990,{"$f":"_xlfn.XLOOKUP(A43,PERFIL!$A$3:$A$42,PERFIL!$B$3:$B$42)","v":"SP - São Carlos - EDP Graal São Carlos"},"2022-04-14"]
[31991,{"$f":"_xlfn.XLOOKUP(A44,PERFIL!$A$3:$A$42,PERFIL!$B$3:$B$42)","v":"SP - São José dos Campos - EDP GAP Dutra"},"2022-04-14"]

{"sheet":"COMENTARIOS","index":13,"n_rows":155,"n_cols":4,"rows_kept":155,"cut":false,"hidden":false,"merged":[]}
["Area_dimensao","Comentário","Classificacao","VISUALIZA01"]
["Eletropostos","Acho que a WeCharge está de parabéns, acredito que poderia ajustar melhor o preço do kW/h pois ainda está um pouco acima da média dos demais… tupinambá R$ 1.70 kW/h e também eletropostos ultrarrápidos.",null,31940]
["Eletropostos","Baratear mais o kilowatt.",null,31940]
["Eletropostos","É necessário que seja instalado mais pontos de carga em Camburi, só tem um carregador e é meio lento. Então está sempre com fila.",null,31940]
["Eletropostos","Eletroposto de Guarapari em péssimo local. Perto das escunas, não dá para manobrar e jogar o carro de re, aval conector atrás. Vaga constantemente ocupada por outros carros. Sugestão: cobrar tempo de ociosidade.",null,31940]
["Eletropostos","Há apenas 1 carregador ultrarrápido.",null,31940]
["Eletropostos","Necessário carregadores DC ao longo das Rodovias.",null,31940]
["Eletropostos","Opção de recargas de boa qualidade, com equipamentos funcionando na normalidade.",null,31940]
["Eletropostos","Precisamos criar uma infraestrutura de carregamento rápido a cada 150km. Manhuaçu é um ótimo ponto para interligar BH a VIX.",null,31940]
["Eletropostos","Última vez que fui usar o carregador da Praia de Camburi, estava com defeito. Talvez otimizar as manutenções preventivas.",null,31940]
["Eletropostos","Alguns dos carregadores estão mostrando sinais de deterioração, importante manutenção preventiva.",null,31940]
["Eletropostos","Carregamento lento e sem cobertura contra sol e chuvas.",null,31940]
["App WeCharge","Carregador AC em rodovia não favorece ao usuário que viaja. Não se programa uma viagem onde se leva 06 horas para carregamento de carro no meio do caminho.",null,31940]
["App WeCharge","Poderia ter opção de pagar com cartão de credito direto no carregador para o caso d3 ausência de Internet.",null,31940]
["Eletropostos","Garantir conexão de internet mais estável nos eletropostos, pois eventualmente a comunicação via internet não funciona.",null,31940]
["Eletropostos","Gostaria que tivesse mais pontos ao longo das rodovias",null,31940]
["Eletropostos","Pelotas poucas vezes que usei gostei muito , só que a maioria fica fora das minhas rotas, que seriam BR290 entre POA E URUGUAIANA e a BR293 entre Livramento a Pelotas.",null,31940]
["Eletropostos","A BR-285 é uma rodovia muito importante no RS e carece de eletro postos, deixo a sugestão para avaliarem a instalação na cidade de Passo Fundo, ponto estratégico na rota FLORIPA -> IJUI.",null,31940]
["Eletropostos","Agradeço pela disponibilidade dos carregadores, mas como todo proprietário de carro elétrico, sempre queremos mais pontos.",null,31940]
["Eletropostos","Apenas 1 carregador rápido, ficou em manutenção por muito tempo, fila de espera Podendo levar até 4 horas para carregar no rápido, pontos de recarga pagos em um valor muito caro no k/h. Muitos veículos elétricos em circulação para pouquíssimo pontos de recarga.",null,31940]
["Eletropostos","Deveriam existir mais pontos de carregamento rápido. Como Florianópolis, uma capital turística só tem 1 ponto de carregamento rápido que fica no shopping Beira Mar e está desligado?!",null,31940]
["Eletropostos","Bom funcionamento e bom atendimento. Algumas manutenções recorrentes. Tempo de carga poderia ser melhor, para todos os carregadores AC.",null,31940]
["Eletropostos","Colocar em São José SC, carregadores rápidos pois lentos tem um monte. Aumentar a quantidade de carregador rápido no centro de Florianópolis, tem somente 1 rápido no beira mar shopping que está em manutenção.",null,31940]
["Eletropostos","Colocar mais eletropostos em locais onde a vaga não concorra com outras atividades que não seja de carregamento. É muito comum eu encontrar vagas de eletroposto ocupada com quem foi comprar algo na esquina.",null,31940]
["Eletropostos","Estou exatamente satisfeito com a WeCharge, penso apenas que poderia ter mais opções de recarga no trajeto entre Florianópolis e Brusque na SC-410, sentido Canelinha.",null,31940]
["Eletropostos","Falta identificação do tipo de carregamento. Exemplo: 7Kw/h 22Kw/h 60Kw/h Deveria ter mais opções de carregamento rápido. A maioria dos carregadores estavam desligados (chave geral). Somente depois de ver outros usuários ligando os dispositivos é que pude colocar meu carro em vaga de 7Kw/h.",null,31940]
["Eletropostos","Havia 3 carregadores que não funcionavam. Sem aviso algum. Apenas um carregador rápido",null,31940]
["Eletropostos","No Shopping Beira Mar tem muitos aparelhos com problemas e muita demora para solucionar. Seria interessante melhorar isso.",null,31940]
["Eletropostos","O aplicativo tem melhorado antes demorava muito para dar o inicio.",null,31940]
["Eletropostos","O valor para recarregar é muito caro. Não faz sentido usar WeCharge em pontos urbanos, pois prefiro carregar em casa. Nas estradas ainda não me sinto seguro em viajar com carro elétrico, por isso não utilizo.",null,31940]
["Eletropostos","Poderia haver mais carregadores ultrarrápidos.",null,31940]
["Eletropostos","Preciso de mais carregadores rápidos.",null,31940]
["Eletropostos","Predominância de carregadores em estacionamentos pagos. Deveriam focar em espaços de mais fácil acesso e em carregadores rápidos.",null,31940]
["Eletropostos","Se tem um serviço deste disponível, o que se espera é no mínimo um carregamento rápido e que eu não precise ficar 3h no local esperando.",null,31940]
["Eletropostos","Espero que a WeCharge expanda muito seus Eletropostos.",null,31940]
["Eletropostos","Opção gratuita em locais que se paga estacionamento.",null,31940]
["App WeCharge","Ao realizar múltiplos inícios de carga, devido a falha na conexão inicial, estornar automaticamente o valor pago da taxa de conexão e cobrar apenas uma.",null,31940]
["App WeCharge","As manutenções dos pontos de recarga precisar ser rápidos e eficazes.",null,31940]
["App WeCharge","Funciona bem e a comunicação via WhatsApp é muito boa.",null,31940]
["App WeCharge","Precisa de mais carregadores rápidos.",null,31940]
["App WeCharge","Precisamos de mais opções em na Grande Florianópolis, em São José.",null,31940]
["App WeCharge","Sempre prestativos e rápidos em dar uma resposta.",null,31940]
["Eletropostos","A quantidade de conectores disponíveis em cada eletroposto é muito pequena. Normalmente são 2 conectores de carga rápida. Com a crescente demanda é necessário aumentar isso em todos os eletropostos pois a espera está cada vez maior.",null,31940]
["Eletropostos","A única crítica é a escassez de eletropostos na cidade de SP.",null,31940]
["Eletropostos","Acompanho os comentários acerca da disponibilidade dos carregadores no PlugShare e tenho a impressão que os carregadores ficam indisponíveis por tempo demasiado em função de necessidade de reparo, isto é, há uma demora aparente entre o carregador quebrar e ficar disponível novamente.",null,31940]
["Eletropostos","Acredito que precisam melhorar a quantidade de DC São Paulo à Curitiba. Também criar algum tipo de cobertura!! Poderia ser até de placa solares além de que poderia utilizarem a energia produzida e assim criar uma cobertura no local de carregamento!",null,31940]
["Eletropostos","Ainda tem poucos pontos de recarga precisam ter mais e com carregadores ultra rápidos, quem esta na estrada não quer ficar muito tempo parado. Outro ponto a melhorar é a divulgação de onde tem os pontos de recarga nas pistas com placas de sinalização.",null,31940]
["Eletropostos","Apenas 1 posto em funcionamento na Regis Bittencourt, apenas 1 conector vcs 2, para toda a demanda da estrada.",null,31940]
["Eletropostos","As instruções de carregamento são pouco claras. Embora o carregador do eletroposto clube dos 500 tenha mais de um conector, somente um funciona de cada vez, e aí o aplicativo enlouquece tentando ativar um carregador já ocupado. Outra coisa interessante seria o aplicativo mostrar se há fila e quanto tempo falta para o carro que está carregando terminar, para o viajante ter como se planejar.",null,31940]
["Eletropostos","Bom dia Difícil carregar, sempre está com problema, da última vez coloquei crédito no pix, não entrou o crédito, mas o Pix foi feito,",null,31940]
["Eletropostos","Tentei várias vezes realizar o carregamento rápido e sempre apareceu mensagem de que não era possível realizar o carregamento. Meu veículo é um GWM HAVAL H6.",null,31940]
["Eletropostos","Cabos dos carregadores ultrarrápidos um pouco curto, mais estão de parabéns.",null,31940]
["Eletropostos","DC não funciona. Tem que esperar no Sol.",null,31940]
["Eletropostos","Carregador no posto Petr open sempre com problemas e desligado. Já em santa barbara doeste, potencia limitada.",null,31940]
["Eletropostos","Carregadores quebrados por meses, força o uso do lento, acabo optando por outros carregadores como o sell Recharge e atm. próximo a São José do Rio Preto.",null,31940]
["Eletropostos","Com a venda de vários veículos BYD está difícil achar carregador desocupado....precisa ampliar urgente a infraestrutura de carregamento elétrico ....eu possuo carregamento elétrico em minha residência mas minha autonomia é de ate 380 KM ...então fico preocupado em fazer viagens de longa distancia.",null,31940]
["Eletropostos","Continuem neste caminho pois seus serviços estão ajudando bastante e com qualidade, parabéns. Aumentem os carregadores nas cidades, em Santo André tem muito carro elétrico e poucos pontos de abastecimento.",null,31940]
["Eletropostos","Deveria disponibilizar mais pontos de recarga em um mesmo posto para evitar ter que esperar outro veículo terminar. Reduzir o valor cobrado pelo KW.",null,31940]
["Eletropostos","Deveria ter mais carregadores rápidos, pois os carregadores seminários tomam muito tempo e poucas pessoas os utilizam durante as viagens.",null,31940]
["Eletropostos","Deveria ter mais postos. Próximo a pouso alegre sentido São Paulo.",null,31940]
["Eletropostos","Em ambos eletropostos citados os carregadores ultra rápidos raramente estão funcionando no rancho português e no graal seguido Atibaia desde de que comprei o carro jamais funcionou são mais de seis meses e sempre com promessas de conserto.",null,31940]
["Eletropostos","Especialmente nos localizados nos graal, não dá para confiar que o carregador estará disponível e funcionando. É necessário investir na quantidade de carregadores e manutenção",null,31940]
["Eletropostos","Eu uso o Graal São Carlos quando vou visitar meu filho, quando ele está disponível. Minhas críticas são 1) os carregadores ficam muitas semanas fora de operação, o que gera uma fila enorme no que opera sozinho 2) não são rápidos. Mesmo o DC de 150kw nunca passa de 30kw Quando a fila está grande, vou ao volvo do Posto Castelo. Ele é mais longe e mais caro, mas é rápido, está sempre operacional e nunca tem fila.",null,31940]
["Eletropostos","Excelentes localizações, faculdade para operar os terminais mais, preço justo, contudo muito necessário ampliar o número de carregadores de carga rápida pois o tempo de espera qdo tem outro Veículo é muito grande.",null,31940]
["Eletropostos","Existe um trecho com apenas um eletroposto que seria na Rodovia dos Bandeirantes entre o trecho de Campinas até Americana, e de Americana até São Pedro (Rod. Luiz de Queiroz passando por Piracicaba). Esse trecho inteiro só tem um carregador rápido no trecho de volta para São Paulo no Graal na Bandeirantes. Esse trajeto precisa de uma infra muito melhor. A Riviera é ótimo para carregar sempre carrego 100% lá.",null,31940]
["Eletropostos","Falta perguntar se tive problemas com os carregadores. Se cheguei e o carregador entrou em pane, como acontece regularmente no Topázio.",null,31940]
["Eletropostos","Faltam Eletropostos no interior de SC, no interior do RS e também do PR.",null,31940]
["Eletropostos","Fiquei muito decepcionado pois o equipamento do Graal Oliveira (MG) está instalado há anos e nunca foi inaugurado. Já minha experiência de recarga no Graal de Perdões foi ótima.",null,31940]
["Eletropostos","Gostaria que tivesse carregador também em Limeira na anhanguera sentido capital interior, pois só tem na volta.",null,31940]
["Eletropostos","Habilitar também o pagamento sem o uso de app ou seja via “maquininha “",null,31940]
["Eletropostos","Informações de menos, app com pouca informação e preço elevado são mistura que só complica a vida de quem realmente já está usando e pagando pelos serviços.",null,31940]
["Eletropostos","Mairiporã abandonado, dos dois lados.",null,31940]
["Eletropostos","Mais carregadores rápidos. Preço acessível. Preço cobrado muito alto.",null,31940]
["Eletropostos","Manutenção e péssima, 6 meses e não arrumam o carregar DC em Mairiporã. Isto traz uma falta de confiança na empresa, pois não podemos confiar no ponto de abastecimento",null,31940]
["Eletropostos","Na verdade já passei por algumas surpresas carregador quebrado muita dificuldade com formas de pagamento. Acho bem precário ainda a utilização não só de vocês como de todos as outras operadoras. Pessoas idosas jamais conseguiram acionar um equipamento desses.",null,31940]
["Eletropostos","Não aceito o custo da recarga, esse valor deveria ser pago pelo estabelecimento que ganha com o meu consumo, assim não frequento mais locais que cobraram a recarga, ainda mais no custo exorbitante. Meu carro é híbrido, 170 km de autonomia, abasteço na minha casa sem custo com placa solar e uso o motor a combustão quando não encontro posto de recarga no modelo que o custo é pago pelo estabelecimento e também nesse caso não frequento mais o local, por mim deve falir. Esse é o modelo que as redes sociais dos adeptos de veículos eletrificados querem, qualquer outro modelo vai falir, ouçam a voz das redes e não tentem impor um modelo que não aceitamos.",null,31940]
["Eletropostos","Não temos opções entre carregar na WeCharge, ou outro eletroposto como ocorre com os demais postos de combustíveis. Temos que recarregar o veículo, onde há pontos disponíveis, tive que desistir de ir a cidade de Aguas de Lindoia, pois não existe nenhum eletroposto para efetuarmos a recarga.",null,31940]
["Eletropostos","No abastecimento que fiz na Dutra, não conseguia carregar, tive que colocar credito na conta de vocês e depois de uma longa espera, o sistema acabou debitando do  meu cartão de credito. Neste final de semana, sábado dia 14/09/2024 ) fiquei mais de meia hora na Fernão dias para carregar menos de 1kw.",null,31940]
["Eletropostos","No Graal Coral, minha última experiência foi horrível e aconteceu no ultimo domingo! Não consegui carregar, liguei para o suporte que não conseguiu resolver. Disse que havia problemas de comunicação da internet. É a segunda vez que acontece isso nesse posto e até agora não tiveram competência ou vontade para resolver. Sinto-me inseguro em utilizar esse carregador numa viagem! Reclamei antes mas nada! Fiquei quase uma hora no suporte numa temperatura de quase 40 graus! Perdi meu tempo no domingo! Não tem problema, logo o mercado chuta vocês para fora!",null,31940]
["Eletropostos","No meu caso o que achei muito ruim na ultima vez que utilizei o serviço foi que no carregador tinha um veiculo parado ocupando 2 vagas de carregamento, e depois descobri que um dos pontos não estava funcionando. Acredito que uma maior monitoração dos pontos para que os mesmos se mantenham funcionando o maior tempo possível seria muito importante.",null,31940]
["Eletropostos","No período de um ano, consegui utilizar os carregadores da WeCharge apenas 3 vezes, sendo que em todas elas, precisei iniciar a recarga por meio do 0800, já que o app nunca funcionou. Normalmente, o carregador aparece como disponível, mas não libera para a recarga.",null,31940]
["Eletropostos","Nunca consegui carregar no eletroposto do Graal Mairiporã. Carregador DC está sempre inoperante. Por 2 vezes não consegui recarregar no DC do Graal Racho Português por estar inoperante. Sugiro, além da opção do aplicativo, implementar máquinas de cartão no próprio carregador. Falta uma cobertura sobre os carregadores para em dias de chuva ou com muito sol.",null,31940]
["Eletropostos","O app não tem informações atualizadas, já tentei usar algumas vezes e o equipamento não esta funcionando.",null,31940]
["Eletropostos","O estado de conservação dos terminais deixa muito a desejar, assim como o número de vagas disponíveis, fazia sentido poucas vagas quando a recarga era gratuita, mas agora com a cobrança, é imprescindível lugares com mais pontos de carregamento. Um ponto por localidade não é mais aceitável.",null,31940]
["Eletropostos","O preço cobrado pelo é exagerado levando em consideração o valor cobrado pela concessionária.",null,31940]
["Eletropostos","O sistema de carga é muito bom, acho que nos postos de estrada deveria ter só o carregador de carga rápida, para fazer o carregamento enquanto eu me alimento.",null,31940]
["Eletropostos","O suporte técnico poderia funcionar no fim de semana também. Por duas vezes estive no posto GAP São Jose dos Campos na Dutra tem fim de semana e não estava funcionando.",null,31940]
["Eletropostos","O tempo para manutenção do carregador DC do Rancho Português foi muito longo.",null,31940]
["Eletropostos","O valor cobrado poderia ser menor. Falta uma cobertura porque se estiver chovendo é complicado. E dia de muito sol também.",null,31940]
["Eletropostos","Péssimo equipamento e atendimento despreparado.",null,31940]
["Eletropostos","Por favor coloque mais eletro postos no interior ex. Sorocaba, Piracicaba, praia grande, bairro Guilhermina, Itanhaém, santos não precisa já tem o suficiente",null,31940]
["Eletropostos","Por favor mais pontos!",null,31940]
["Eletropostos","Postos com poucos carregadores rápidos. Precárias informações sobre a forma de carregamento. Deveria existir um passo a passo claro sobre a forma de se iniciar um carregamento.",null,31940]
["Eletropostos","Precisa baixar os preços.",null,31940]
["Eletropostos","Precisamos com certeza de mais eletropostos por aí, principalmente nas vias mais movimentadas de São Paulo... Pra ajudar com força mesmo a gente que tá na vida do elétrico, talvez até baratear um pouco o custo de recarga seria formidável.",null,31940]
["Eletropostos","Precisamos de mais eletropostos.",null,31940]
["Eletropostos","Precisamos de mais infraestrutura de carregamento para viagens. Gostei de utilizar os da WeCharge, mas talvez pudesse ter um telhadinho perto das bombas. No Rancho Português e no EDP Dutra tive dificuldade pra ver o visor por conta do sol. Se estivesse chovendo seria difícil também.",null,31940]
["Eletropostos","Primeiro ponto seriam ter mais de 1 carregador CCS2 e também em todos podermos ver se está em uso. A função de reservar até 15min antes do uso também seria muito útil, evitando imprevistos em cima da hora. Por fim, região sul carece de mais infra também, assim como o goiás, ligação entre Brasília e Uberlândia, temos que ir por GYN, dando uma boa volta, para ir com mais segurança por conta dos postos.",null,31940]
["Eletropostos","O problema é a falta de opões para carregamento, e também grande probabilidade do equipamento com defeito não podendo carregar, tenho um veículo híbrido que anda 130-140 km no elétrico, a falta de estrutura para carrega-lo esta me fazendo pensar em trocar de carro.",null,31940]
["Eletropostos","Quando abasteci no EDP posto nacional, eu não ha ia identificado a existência do carregador, pois ao lado tem os carregadores do restaurante, que não atenderam minha necessidade. Por sorte um senhor me indicou a existência do carregador, bem próximo.",null,31940]
["Eletropostos","Quando carreguei no Graal de Ribeirão Preto a bomba estava livre. Acredito que com o aumento de carros elétricos serão necessárias bombas adicionais de 150kw, assim o nosso tempo de utilização diminua para que outros também possam usá-las.",null,31940]
["Eletropostos","Seria interessante 2 carregadores rápidos por localidade mais um carregador de 22kw e um de 7kw.",null,31940]
["Eletropostos","Ter mais que um carregador rápido é importante! Por várias vezes tem alguém carregando no rápido e preciso fica esperando 1 h ou mais para começar a carregar o meu carro.",null,31940]
["Eletropostos","Tive 2 ou 3 problemas com o funcionamento. O processo de recarga, de créditos, etc. é muito confuso o que toma muito tempo.",null,31940]
["Eletropostos","Tive problemas sérios da primeira vez que usei. Fui bem atendido mas demorou mais de 1h para resolver. Depois, nunca mais. Como sugestão, coloquem algum tipo de proteção contra chuva e sol no local. Passar aqueles 5 minutos na frente do carregador lidando com o app embaixo de chuva não é bom. O mesmo no Sol tropical do nosso país. Eu sou rápido, mas tem gente q passa 15 min até fazer o procedimento. Já ajudei muita gente a completar a carga. Espero a rede com dezenas de milhares de postos que vcs vão implantar no país. Boa sorte e se precisarem de ajuda avisem!",null,31940]
["Eletropostos","Três rotas que faço mensalmente são carentes de carregadores. Partindo de São Paulo a Maringá, São Paulo a Brasília e São Paulo a Curitiba. Na estrada só deve ter carregadores rápidos de preferência 150 w, ninguém quer ficar parado muito tempo.",null,31940]
["Eletropostos","Varias tentativas de recarga com a WeCharge e equipamentos não funcionando/em manutenção.",null,31940]
["Eletropostos","WeCharge do Clube 500, só carrega um carro por vez, então não consegui carregar meu carro. Posto Graal Perdoes, não estava funcionando nenhum carregador.",null,31940]
["Eletropostos","Eletropostos de registros quebrados, mal sinalizados, fora do ar, informações ruins no app. manutenção precisa estar em dia. vários AC sem funcionar e o DC do Buenos aires fora do ar destrói a viagem.",null,31940]
["Eletropostos","Gostaria que tivesse mais eletro posto na Dutra. Ótimo atendimento.",null,31940]
["Eletropostos","Instalar mais carregadores DC com pistola ChadeMO.",null,31940]
["Eletropostos","Na Riviera não estava funcionando e ninguém do shopping era responsável, só foi resolvido o problema quando fiz uma reclamação no reclame aqui",null,31940]
["Eletropostos","No mínimo deveria existir um em cada município brasileiro.",null,31940]
["Eletropostos","O eletroposto do Graal ou Buenos Aires, não me recordo não tem cobertura.",null,31940]
["Eletropostos","O maior problema é q os carregadores estão desligados, manutenção ou fora do ar. Por estar inoperantes tem pouca confiança de q vai dar certo carregar. Também, na Dutra são carregadores de um totem, não dá de carregar dois carros em DC ao mesmo tempo. Precisaria de mais estações.",null,31940]
["Eletropostos","O numero de eletropostos na Dutra é muito pequeno. A quantidade deveria ser pelo menos três pontos. Já fiquei em fila ou sem carregar devido à quebra de alumínio posto. Deveria haver pontos a pelo menos 50km de cada posto. Desculpe , mas é uma vergonha: na Dutra, a principal via do Brasil. A ativação deveria ser mais simples. Os SW são complicados.",null,31940]
["Eletropostos","Observo que a quantidade de carregadores que estão operando é muito pequena em relação a quantidade hoje de veículos que necessita desse serviço.",null,31940]
["Eletropostos","Os carregadores rápidos no Graal Mairiporã está sempre quebrado e fora de serviço. E você só descobre quando chega no local, que é meio escuro também. E na rodovia, o que faz sentido é carregador rápido, pois os lentos demandam muitas horas de espera e funciona mais em shoppings onde você pode pegar um cinema ou algo assim.",null,31940]
["Eletropostos","Poderiam reduzir o tempo de manutenção de eletropostos que apresentem falhas ou na realocação como no caso do Serramar Shopping.",null,31940]
["App WeCharge","A minha mulher não quer mais andar com carro elétrico, devido às falhas e esperas.",null,31940]
["App WeCharge","Colocar placas nas rodovias indicando aonde tem é fundamental poque a internet ainda não funciona plenamente nas estradas.",null,31940]
["App WeCharge","Com a demanda de carros elétricos aumentando a infraestrutura deixa muito a desejar.",null,31940]
["App WeCharge","Consertem o carregador rápido do Graal Mairiporã! Há meses sem funcionar.",null,31940]
["App WeCharge","Das vezes que precisei do suporte técnico deixou muito a desejar, pois geralmente era aos finais de semana, e não tinha atendimento.",null,31940]
["App WeCharge","Deveria ter a opção de pagar direto no cartão nos eletropostos. Ou a opção de pagar com Apple Pay no app.",null,31940]
["App WeCharge","Deveria ter internet patrocinada no aplicativo igual alguns concorrentes, ou seja, se estiver sem créditos no celular e sem internet o aplicativo funcionar da mesma forma.",null,31940]
["App WeCharge","Dificuldade de verno mapa outros eletropostos.",null,31940]
["App WeCharge","É preciso que se aumente a oferta de eletropostos nas cidades do interior de São Paulo, pois aumentou muito a demanda por veículos elétricos e não temos infraestrutura e principalmente SEGURANÇA E TRANQUILIDADE de vamos encontrar uma tomada disponível e uma recarga mais rápida para recarregar e seguir viagem, pois muitas vezes quando se chega em um eletroposto o equipamento está OCUPADO, EM MANUTENÇÃO E ATÉ MESMO DANIFICADO, sem contar que também não existe um bom sinal de internet para abrir o aplicativo da WeCharge para dar inicio a recarga da bateria do veículo",null,31940]
["App WeCharge","Empresa sem capacidade de ofertar o serviço para ofertado.",null,31940]
["App WeCharge","falta de opção para carregamento é o grande problema do Brasil hoje.",null,31940]
["App WeCharge","Liberar o pagamento com cartão.",null,31940]
["App WeCharge","Liguei suporte não resolveu nada.",null,31940]
["App WeCharge","Na primeira vez fiquei com o veículo preso no carregador após a carga por 40 minutos na madrugada e não havia suporte, nem a loja estava aberta e nem o 0800 funcionava no horário.",null,31940]
["App WeCharge","Na última utilização p utilização o voucher cadastrado e com vaidade até dezembro 2024 desapareceu, na central ele confirmou que estavam com problemas pontuais, vou confirmar na próxima vez.",null,31940]
["App WeCharge","Não sei se já faz, mas o app poderia mostrar em tempo real a disponibilidade dos carregadores, assim como o Shell Recharge.",null,31940]
["App WeCharge","Nenhum comentário. Tudo funcionando de acordo com minhas necessidades.",null,31940]
["App WeCharge","Nos 3 eletropostos que faço parada em minhas viagens, praticamente nenhum carregador funcionou num prazo de um ano de tentativas",null,31940]
["App WeCharge","Nuca usei para saber a disponibilidade, nem conhecia essa função. SUGESTÃO: faça com q o app possa ser usado no sistema dos carros através do Apple CARPLAY. Vai ficar muito mais fácil de usar antes de chegar para saber onde estão e se estão ocupados os carregadores.",null,31940]
["App WeCharge","O aplicativo não é claro, entre o que tenho na \"carteira\" e o que tenho para utilizar. Avisa somente no final do processo, é demorado e lento. E algumas vezes, não funciona.",null,31940]
["App WeCharge","O APP é muito intuitivo e cumpre o q promete. Apenas uma vez acionei o suporte e foi muito bom e rápido.",null,31940]
["App WeCharge","O app precisa manter link pro suporte via WhatsApp.",null,31940]
["App WeCharge","O App WeCharge é fácil de usar.",null,31940]
["App WeCharge","O atendimento do suporte via telefone foi o diferencial em qualidade deste serviço, atenciosos, ágeis e bem treinados.",null,31940]
["App WeCharge","Os equipamentos DC são muito bons, porém quando funciona que em alguns casos é raro.",null,31940]
["App WeCharge","Parei de usar o APP quando as recargas são pagas, não aceitamos esse modelo de negócio. Procurem outro modelo ou peçam concordata.",null,31940]
["App WeCharge","Poderia trocar o pagamento por cartão pelo PIX. Não seria viável para a empresa?",null,31940]
["App WeCharge","Principal dificuldade é quanto os meios de pagamento. Ainda bem que tem o carregamento de saldo pré pago cartão de crédito nenhum funciona.",null,31940]
["App WeCharge","Só tive problema nas minhas duas ultimas cargas.",null,31940]
["App WeCharge","Somente gostaria de mais pontos de recarga.",null,31940]
["App WeCharge","Sou da área de tecnologia, portanto talvez estes pontos sejam mais tranquilos do que para outras pessoas.",null,31940]
["App WeCharge","Suporte excelente todas as vezes que precisei.",null,31940]
["App WeCharge","Suporte quando necessário foi excelente.",null,31940]
["App WeCharge","Tentei apagar os dados de um cartão de crédito que não uso mais e só achei a opção de adicionar cartão. Como não preveem a opção de excluir ao lado adicionar? Muito básico isso! Outra coisa, é que coloca um meio de pagamento como padrão e não um lugar onde você mude isso de maneira fácil.",null,31940]
["App WeCharge","Toda vez que entra pede a senha de novo, cadastro de cartão cai muito rápido, devia funcionar com sem parar também.",null,31940]
["App WeCharge","Vocês precisam dar mais informações no pontos de recargas.",null,31940]